null
SMILES: CCCN(CCC)C(=O)c1cccc(c1)C(=O)N[C@@H](Cc1ccccc1)[C@@H](N)C[C@@H](C)C(=O)N[C@@H](C(C)C)C(=O)NCc1ccccc1
InChI Key: InChIKey=CFGDZHHUKZKWPM-FXLHSRMHSA-N
Activity Spreadsheet -- Enzyme Inhibition Constant Data from BindingDB
Found 1 hit for monomerid = 16291
Trg + Lig
Ki
nM
ΔG°
kcal/mole
IC50
nM
Kd
nM
EC50/IC50
nM
koff
s-1
kon
M-1s-1
pHTemp
°C
Beta-secretase 1 [22-454]
(Homo sapiens (Human))
BDBM16291
(3-N-[(2S,3S,5R)-3-amino-5-{[(1S)-1-(benzylcarbamoy...)
Show SMILES CCCN(CCC)C(=O)c1cccc(c1)C(=O)N[C@@H](Cc1ccccc1)[C@@H](N)C[C@@H](C)C(=O)N[C@@H](C(C)C)C(=O)NCc1ccccc1 |r|
Show InChI InChI=1S/C39H53N5O4/c1-6-21-44(22-7-2)39(48)32-20-14-19-31(25-32)37(46)42-34(24-29-15-10-8-11-16-29)33(40)23-28(5)36(45)43-35(27(3)4)38(47)41-26-30-17-12-9-13-18-30/h8-20,25,27-28,33-35H,6-7,21-24,26,40H2,1-5H3,(H,41,47)(H,42,46)(H,43,45)/t28-,33+,34+,35+/m1/s1
33 -10.1n/an/an/an/an/a4.522
Sunesis
Assay Description
Compounds were tested for their ability to inhibit BACE-1 hydrolysis of the internally quenched fluorescent substrate FS-2. Reactions were initiated ...
J Med Chem 49: 839-42 (2006)
Article DOI: 10.1021/jm0509142
BindingDB Entry DOI: 10.7270/Q2PV6HM0