BDBM162989 US9056865, A-116
SMILES: Cc1cnc(c(C)c1)-c1cc(ncc1Cl)N1CCN(CC1)C(=O)CCS(C)(=O)=O
InChI Key: InChIKey=BBVNTTZIOTWDSV-UHFFFAOYSA-N
Data: 1 IC50
Activity Spreadsheet -- Enzyme Inhibition Constant Data from BindingDB
Found 1 hit for monomerid = 162989
Trg + Lig
Ki
nM
ΔG°
kcal/mole
IC50
nM
Kd
nM
EC50/IC50
nM
koff
s-1
kon
M-1s-1
pHTemp
°C
G-protein- coupled-like receptor Smoothened (Smo)
(Homo sapiens (Human))
BDBM162989
(US9056865, A-116)
Show SMILES Cc1cnc(c(C)c1)-c1cc(ncc1Cl)N1CCN(CC1)C(=O)CCS(C)(=O)=O
Show InChI InChI=1S/C20H25ClN4O3S/c1-14-10-15(2)20(23-12-14)16-11-18(22-13-17(16)21)24-5-7-25(8-6-24)19(26)4-9-29(3,27)28/h10-13H,4-9H2,1-3H3
US Patent
n/an/a 6.80n/an/an/an/an/a25
Pfizer Inc.
US Patent
Assay Description
For the binding competition assay, 100 μL of Assay Buffer was added to all the wells of a 96 well GF/B filter plate (Millipore MultiScreen-HTS-F...
US Patent US9056865 (2015)
BindingDB Entry DOI: 10.7270/Q2R49PH7