BDBM16318 3-({5-cyano-6-[(2,2-dimethylpropyl)(methyl)amino]-2-(methylamino)pyrimidin-4-yl}amino)-N-methoxy-4-methylbenzamide::5-Cyanopyrimidine Derivative 8a
SMILES: CNc1nc(Nc2cc(ccc2C)C(=O)NOC)c(C#N)c(n1)N(C)CC(C)(C)C
InChI Key: InChIKey=XJGYVASDBIPRAF-UHFFFAOYSA-N
Data: 1 KI
Activity Spreadsheet -- Enzyme Inhibition Constant Data from BindingDB
Found 1 hit for monomerid = 16318
Trg + Lig
Ki
nM
ΔG°
kcal/mole
IC50
nM
Kd
nM
EC50/IC50
nM
koff
s-1
kon
M-1s-1
pHTemp
°C
Mitogen-activated protein kinase 14
(Homo sapiens (Human))
BDBM16318
(3-({5-cyano-6-[(2,2-dimethylpropyl)(methyl)amino]-...)
Show SMILES CNc1nc(Nc2cc(ccc2C)C(=O)NOC)c(C#N)c(n1)N(C)CC(C)(C)C
Show InChI InChI=1S/C21H29N7O2/c1-13-8-9-14(19(29)27-30-7)10-16(13)24-17-15(11-22)18(26-20(23-5)25-17)28(6)12-21(2,3)4/h8-10H,12H2,1-7H3,(H,27,29)(H2,23,24,25,26)
NCI pathway
Reactome pathway
0.0470 -13.9n/an/an/an/an/a7.422
Bristol-Myers Squibb Company
Assay Description
The kinase activity was determined by quantitation of the amount of radioactive phosphate transferred to myelin basic protein (MBP) with or without i...
J Med Chem 48: 6261-70 (2005)
Article DOI: 10.1021/jm0503594
BindingDB Entry DOI: 10.7270/Q25X276T