BDBM16322 3-{[5-cyano-6-(propylamino)pyrimidin-4-yl]amino}-N-methoxy-4-methylbenzamide::5-Cyanopyrimidine Derivative 14b
SMILES: CCCNc1ncnc(Nc2cc(ccc2C)C(=O)NOC)c1C#N
InChI Key: InChIKey=HSQMAKZHOAZZPL-UHFFFAOYSA-N
Data: 1 KI
Activity Spreadsheet -- Enzyme Inhibition Constant Data from BindingDB
Found 1 hit for monomerid = 16322
Trg + Lig
Ki
nM
ΔG°
kcal/mole
IC50
nM
Kd
nM
EC50/IC50
nM
koff
s-1
kon
M-1s-1
pHTemp
°C
Mitogen-activated protein kinase 14
(Homo sapiens (Human))
BDBM16322
(3-{[5-cyano-6-(propylamino)pyrimidin-4-yl]amino}-N...)
Show SMILES CCCNc1ncnc(Nc2cc(ccc2C)C(=O)NOC)c1C#N
Show InChI InChI=1S/C17H20N6O2/c1-4-7-19-15-13(9-18)16(21-10-20-15)22-14-8-12(6-5-11(14)2)17(24)23-25-3/h5-6,8,10H,4,7H2,1-3H3,(H,23,24)(H2,19,20,21,22)
NCI pathway
Reactome pathway
0.970 -12.2n/an/an/an/an/a7.422
Bristol-Myers Squibb Company
Assay Description
The kinase activity was determined by quantitation of the amount of radioactive phosphate transferred to myelin basic protein (MBP) with or without i...
J Med Chem 48: 6261-70 (2005)
Article DOI: 10.1021/jm0503594
BindingDB Entry DOI: 10.7270/Q25X276T