BDBM1634 2,10-diethyl-2,4,10-triazatricyclo[9.4.0.0^{3,8}]pentadeca-1(11),3(8),4,6,12,14-hexaen-9-one::Pyridobenzodiazepinone deriv. 14
SMILES: CCN1c2ccccc2N(CC)C(=O)c2cccnc12
InChI Key: InChIKey=TUQHQPVULWJHQZ-UHFFFAOYSA-N
Data: 1 IC50
Activity Spreadsheet -- Enzyme Inhibition Constant Data from BindingDB
Found 1 hit for monomerid = 1634
Trg + Lig
Ki
nM
ΔG°
kcal/mole
IC50
nM
Kd
nM
EC50/IC50
nM
koff
s-1
kon
M-1s-1
pHTemp
°C
HIV-1 Reverse Transcriptase
(Human immunodeficiency virus type 1)
BDBM1634
(2,10-diethyl-2,4,10-triazatricyclo[9.4.0.0^{3,8}]p...)
Show SMILES CCN1c2ccccc2N(CC)C(=O)c2cccnc12
Show InChI InChI=1S/C16H17N3O/c1-3-18-13-9-5-6-10-14(13)19(4-2)16(20)12-8-7-11-17-15(12)18/h5-11H,3-4H2,1-2H3
n/an/a 380n/an/an/an/a7.822
Boehringer Ingelheim Pharmaceuticals Inc.
Assay Description
The IC50 of reverse transcriptase is the concentration that inhibits 50% of recombinant HIV-1 RT RNA-directed DNA polymerase activity in vitro.
J Med Chem 34: 2231-41 (1991)
Article DOI: 10.1021/jm00111a045
BindingDB Entry DOI: 10.7270/Q2TT4P4X