BDBM16340 4-(2-chlorophenyl)-5-[3-(propan-2-yl)-[1,2,4]triazolo[3,4-a]pyridin-6-yl]-1,3-oxazole::triazolopyridine oxazole inhibitor 10
SMILES: CC(C)c1nnc2ccc(cn12)-c1ocnc1-c1ccccc1Cl
InChI Key: InChIKey=VODQVPJIDAWTIW-UHFFFAOYSA-N
Data: 1 IC50
Activity Spreadsheet -- Enzyme Inhibition Constant Data from BindingDB
Found 1 hit for monomerid = 16340
Trg + Lig
Ki
nM
ΔG°
kcal/mole
IC50
nM
Kd
nM
EC50/IC50
nM
koff
s-1
kon
M-1s-1
pHTemp
°C
Mitogen-activated protein kinase 14
(Homo sapiens (Human))
BDBM16340
(4-(2-chlorophenyl)-5-[3-(propan-2-yl)-[1,2,4]triaz...)
Show SMILES CC(C)c1nnc2ccc(cn12)-c1ocnc1-c1ccccc1Cl
Show InChI InChI=1S/C18H15ClN4O/c1-11(2)18-22-21-15-8-7-12(9-23(15)18)17-16(20-10-24-17)13-5-3-4-6-14(13)19/h3-11H,1-2H3
NCI pathway
Reactome pathway
n/an/a 3n/an/an/an/a7.230
Pfizer
Assay Description
The IC50s were determined by incubating each test compound with activated p38-alpha in a 96-well plate that had been pre-treated with ATF-2-GST to al...
Bioorg Med Chem Lett 16: 4339-44 (2006)
Article DOI: 10.1016/j.bmcl.2006.05.056
BindingDB Entry DOI: 10.7270/Q2251GFZ