BDBM163647 MbA-G (1)
SMILES: C[C@@H]1O[C@@H](O[C@@H]2CO[C@@H](Oc3c(O)cc(cc3O)-c3oc4cc(O)cc(O)c4c(=O)c3O[C@@H]3O[C@@H](C)[C@H](O)[C@@H](O)[C@H]3O[C@@H]3O[C@H](COC(=O)\C=C\c4ccc(O)c(O)c4)[C@@H](O)[C@H](O)[C@H]3O)[C@H](O)[C@H]2O)[C@H](O)[C@H](O)[C@H]1O
InChI Key: InChIKey=IPPBIAOCNFRZRL-ASIGOSPISA-N
Data: 1 KI
Activity Spreadsheet -- Enzyme Inhibition Constant Data from BindingDB
Found 1 hit for monomerid = 163647
Trg + Lig
Ki
nM
ΔG°
kcal/mole
IC50
nM
Kd
nM
EC50/IC50
nM
koff
s-1
kon
M-1s-1
pHTemp
°C
Pancreatic alpha-amylase (HPA)
(Homo sapiens (Human))
BDBM163647
(MbA-G (1))
Show SMILES C[C@@H]1O[C@@H](O[C@@H]2CO[C@@H](Oc3c(O)cc(cc3O)-c3oc4cc(O)cc(O)c4c(=O)c3O[C@@H]3O[C@@H](C)[C@H](O)[C@@H](O)[C@H]3O[C@@H]3O[C@H](COC(=O)\C=C\c4ccc(O)c(O)c4)[C@@H](O)[C@H](O)[C@H]3O)[C@H](O)[C@H]2O)[C@H](O)[C@H](O)[C@H]1O
Show InChI InChI=1S/C47H54O28/c1-14-29(55)34(60)38(64)45(68-14)71-26-13-67-44(37(63)32(26)58)73-41-22(52)8-17(9-23(41)53)40-42(33(59)28-21(51)10-18(48)11-24(28)70-40)74-47-43(36(62)30(56)15(2)69-47)75-46-39(65)35(61)31(57)25(72-46)12-66-27(54)6-4-16-3-5-19(49)20(50)7-16/h3-11,14-15,25-26,29-32,34-39,43-53,55-58,60-65H,12-13H2,1-2H3/b6-4+/t14-,15-,25+,26+,29-,30-,31+,32-,34+,35-,36+,37+,38+,39+,43+,44-,45-,46-,47-/m0/s1
9.10 -11.1n/an/an/an/an/an/a30
University of British Columbia
Assay Description
Inhibitor concentrations varied from 0.25 to 5 times the Ki value in 50 mM sodium phosphate, 100 mM sodium chloride buffer, pH 7.0, at 30 °C. 2-Chlor...
Nat Chem Biol 11: 691-6 (2015)
Article DOI: 10.1038/nchembio.1865
BindingDB Entry DOI: 10.7270/Q2KD1WP4