BDBM163648 MbA-R (2)
SMILES: C[C@@H]1O[C@@H](Oc2c(oc3cc(O)cc(O)c3c2=O)-c2cc(O)c(O[C@@H]3OC[C@@H](O)[C@H](O)[C@H]3O)c(O)c2)[C@H](O[C@@H]2O[C@H](COC(=O)\C=C\c3ccc(O)c(O)c3)[C@@H](O)[C@H](O)[C@H]2O[C@@H]2O[C@H](CO)[C@@H](O)[C@H](O)[C@H]2O)[C@H](O)[C@H]1O
InChI Key: InChIKey=ZAPQSVSLTNXPNJ-GVQHHMPOSA-N
Data: 1 KI
Activity Spreadsheet -- Enzyme Inhibition Constant Data from BindingDB
Found 1 hit for monomerid = 163648
Trg + Lig
Ki
nM
ΔG°
kcal/mole
IC50
nM
Kd
nM
EC50/IC50
nM
koff
s-1
kon
M-1s-1
pHTemp
°C
Pancreatic alpha-amylase (HPA)
(Homo sapiens (Human))
BDBM163648
(MbA-R (2))
Show SMILES C[C@@H]1O[C@@H](Oc2c(oc3cc(O)cc(O)c3c2=O)-c2cc(O)c(O[C@@H]3OC[C@@H](O)[C@H](O)[C@H]3O)c(O)c2)[C@H](O[C@@H]2O[C@H](COC(=O)\C=C\c3ccc(O)c(O)c3)[C@@H](O)[C@H](O)[C@H]2O[C@@H]2O[C@H](CO)[C@@H](O)[C@H](O)[C@H]2O)[C@H](O)[C@H]1O
Show InChI InChI=1S/C47H54O29/c1-14-29(57)35(63)42(76-47-43(75-45-38(66)34(62)31(59)25(11-48)71-45)36(64)32(60)26(72-47)13-67-27(56)5-3-15-2-4-18(50)19(51)6-15)46(69-14)74-41-33(61)28-20(52)9-17(49)10-24(28)70-39(41)16-7-21(53)40(22(54)8-16)73-44-37(65)30(58)23(55)12-68-44/h2-10,14,23,25-26,29-32,34-38,42-55,57-60,62-66H,11-13H2,1H3/b5-3+/t14-,23+,25+,26+,29-,30-,31+,32+,34-,35+,36-,37+,38+,42+,43+,44-,45-,46-,47-/m0/s1
21.3 -10.6n/an/an/an/an/an/a30
University of British Columbia
Assay Description
Inhibitor concentrations varied from 0.25 to 5 times the Ki value in 50 mM sodium phosphate, 100 mM sodium chloride buffer, pH 7.0, at 30 °C. 2-Chlor...
Nat Chem Biol 11: 691-6 (2015)
Article DOI: 10.1038/nchembio.1865
BindingDB Entry DOI: 10.7270/Q2KD1WP4