BDBM163651 MbA-GRX (5)::mini-MbA
SMILES: C[C@@H]1O[C@@H](Oc2c(oc3cc(O)cc(O)c3c2=O)-c2cc(O)c(O)c(O)c2)[C@H](O[C@@H]2O[C@H](COC(=O)\C=C\c3ccc(O)c(O)c3)[C@@H](O)[C@H](O)[C@H]2O)[C@H](O)[C@H]1O
InChI Key: InChIKey=YHIHWLPOKDIYGF-ZLGVOOGTSA-N
Data: 1 KI
PDB links: 1 PDB ID matches this monomer.
Activity Spreadsheet -- Enzyme Inhibition Constant Data from BindingDB
Found 1 hit for monomerid = 163651
Trg + Lig
Ki
nM
ΔG°
kcal/mole
IC50
nM
Kd
nM
EC50/IC50
nM
koff
s-1
kon
M-1s-1
pHTemp
°C
Pancreatic alpha-amylase (HPA)
(Homo sapiens (Human))
BDBM163651
(MbA-GRX (5) | mini-MbA)
Show SMILES C[C@@H]1O[C@@H](Oc2c(oc3cc(O)cc(O)c3c2=O)-c2cc(O)c(O)c(O)c2)[C@H](O[C@@H]2O[C@H](COC(=O)\C=C\c3ccc(O)c(O)c3)[C@@H](O)[C@H](O)[C@H]2O)[C@H](O)[C@H]1O
Show InChI InChI=1S/C36H36O20/c1-12-25(44)30(49)34(56-35-31(50)29(48)27(46)22(54-35)11-51-23(43)5-3-13-2-4-16(38)17(39)6-13)36(52-12)55-33-28(47)24-18(40)9-15(37)10-21(24)53-32(33)14-7-19(41)26(45)20(42)8-14/h2-10,12,22,25,27,29-31,34-42,44-46,48-50H,11H2,1H3/b5-3+/t12-,22+,25-,27+,29-,30+,31+,34+,35-,36-/m0/s1
93.3 -9.74n/an/an/an/an/an/a30
University of British Columbia
Assay Description
Inhibitor concentrations varied from 0.25 to 5 times the Ki value in 50 mM sodium phosphate, 100 mM sodium chloride buffer, pH 7.0, at 30 °C. 2-Chlor...
Nat Chem Biol 11: 691-6 (2015)
Article DOI: 10.1038/nchembio.1865
BindingDB Entry DOI: 10.7270/Q2KD1WP4
3D
3D Structure (crystal)