BDBM163692 ISOCARBOXAZID::Isocarboxazid (ICD)::Isocarboxazide::Marplan
SMILES: Cc1cc(no1)C(=O)NNCc1ccccc1
InChI Key: InChIKey=XKFPYPQQHFEXRZ-UHFFFAOYSA-N
Data: 1 IC50
Activity Spreadsheet -- Enzyme Inhibition Constant Data from BindingDB
Found 1 hit for monomerid = 163692
Trg + Lig
Ki
nM
ΔG°
kcal/mole
IC50
nM
Kd
nM
EC50/IC50
nM
koff
s-1
kon
M-1s-1
pHTemp
°C
8-Oxoguanine DNA glycosylase-1 (OGG1)
(Homo sapiens (Human))
BDBM163692
(ISOCARBOXAZID | Isocarboxazid (ICD) | Isocarboxazi...)
Show SMILES Cc1cc(no1)C(=O)NNCc1ccccc1
Show InChI InChI=1S/C12H13N3O2/c1-9-7-11(15-17-9)12(16)14-13-8-10-5-3-2-4-6-10/h2-7,13H,8H2,1H3,(H,14,16)
n/an/a>5.00E+4n/an/an/an/a7.537
Oregon Health & Science University
Assay Description
A total of 4 µL of OGG1 (125 nM) was mixed with 1 µL of inhibitor. In a separate tube, 1 µL of freshly prepared 10 mM NaBH3CN (diluted in H2O) was mi...
ACS Chem Biol 10: 2334-43 (2015)
Article DOI: 10.1021/acschembio.5b00452
BindingDB Entry DOI: 10.7270/Q22F7M6H