BDBM163693 Nialamide
SMILES: O=C(CCNNC(=O)c1ccncc1)NCc1ccccc1
InChI Key: InChIKey=NOIIUHRQUVNIDD-UHFFFAOYSA-N
Data: 1 IC50
Activity Spreadsheet -- Enzyme Inhibition Constant Data from BindingDB
Found 1 hit for monomerid = 163693
Trg + Lig
Ki
nM
ΔG°
kcal/mole
IC50
nM
Kd
nM
EC50/IC50
nM
koff
s-1
kon
M-1s-1
pHTemp
°C
8-Oxoguanine DNA glycosylase-1 (OGG1)
(Homo sapiens (Human))
BDBM163693
(Nialamide)
Show SMILES O=C(CCNNC(=O)c1ccncc1)NCc1ccccc1
Show InChI InChI=1S/C16H18N4O2/c21-15(18-12-13-4-2-1-3-5-13)8-11-19-20-16(22)14-6-9-17-10-7-14/h1-7,9-10,19H,8,11-12H2,(H,18,21)(H,20,22)
n/an/a>5.00E+4n/an/an/an/a7.537
Oregon Health & Science University
Assay Description
A total of 4 µL of OGG1 (125 nM) was mixed with 1 µL of inhibitor. In a separate tube, 1 µL of freshly prepared 10 mM NaBH3CN (diluted in H2O) was mi...
ACS Chem Biol 10: 2334-43 (2015)
Article DOI: 10.1021/acschembio.5b00452
BindingDB Entry DOI: 10.7270/Q22F7M6H