BDBM163695 Benzoylhydrazine, P‐bromo (0151-Hy)
SMILES: NNC(=O)c1ccc(Br)cc1
InChI Key: InChIKey=UYIMBYKIIMYFPS-UHFFFAOYSA-N
Data: 1 IC50
Activity Spreadsheet -- Enzyme Inhibition Constant Data from BindingDB
Found 1 hit for monomerid = 163695
Trg + Lig
Ki
nM
ΔG°
kcal/mole
IC50
nM
Kd
nM
EC50/IC50
nM
koff
s-1
kon
M-1s-1
pHTemp
°C
8-Oxoguanine DNA glycosylase-1 (OGG1)
(Homo sapiens (Human))
BDBM163695
(Benzoylhydrazine, P‐bromo (0151-Hy))
Show SMILES NNC(=O)c1ccc(Br)cc1
Show InChI InChI=1S/C7H7BrN2O/c8-6-3-1-5(2-4-6)7(11)10-9/h1-4H,9H2,(H,10,11)
n/an/a 390n/an/an/an/a7.537
Oregon Health & Science University
Assay Description
A total of 4 µL of OGG1 (125 nM) was mixed with 1 µL of inhibitor. In a separate tube, 1 µL of freshly prepared 10 mM NaBH3CN (diluted in H2O) was mi...
ACS Chem Biol 10: 2334-43 (2015)
Article DOI: 10.1021/acschembio.5b00452
BindingDB Entry DOI: 10.7270/Q22F7M6H