BDBM163719 3-Cyclohexyl-5-{4-[4-(2-methoxyphenyl)piperazin-1-yl]butyl}-4,5-dihydro-1,2,4-triazin-6(1H)-one (18)
SMILES: COc1ccccc1N1CCN(CCCCC2NC(=NNC2=O)C2CCCCC2)CC1
InChI Key: InChIKey=ZLZUHWMDENIQAS-UHFFFAOYSA-N
Data: 2 KI
Activity Spreadsheet -- Enzyme Inhibition Constant Data from BindingDB
Found 2 hits for monomerid = 163719
Trg + Lig
Ki
nM
ΔG°
kcal/mole
IC50
nM
Kd
nM
EC50/IC50
nM
koff
s-1
kon
M-1s-1
pHTemp
°C
5-hydroxytryptamine receptor 1A
(Homo sapiens (Human))
BDBM163719
(3-Cyclohexyl-5-{4-[4-(2-methoxyphenyl)piperazin-1-...)
Show SMILES COc1ccccc1N1CCN(CCCCC2NC(=NNC2=O)C2CCCCC2)CC1 |c:19|
Show InChI InChI=1S/C24H37N5O2/c1-31-22-13-6-5-12-21(22)29-17-15-28(16-18-29)14-8-7-11-20-24(30)27-26-23(25-20)19-9-3-2-4-10-19/h5-6,12-13,19-20H,2-4,7-11,14-18H2,1H3,(H,25,26)(H,27,30)
5 -11.3n/an/an/an/an/an/a25
Jagiellonian University Medical College
Assay Description
All assays were incubated in a total volume of 200 mL in 96-well microtiter plates for 1 h at 37 °C, except for 5-HT1ARs which were incubated at room...
Chem Biol Drug Des 86: 697-703 (2015)
Article DOI: 10.1111/cbdd.12539
BindingDB Entry DOI: 10.7270/Q2DR2T86
5-hydroxytryptamine receptor 7
(Homo sapiens (Human))
BDBM163719
(3-Cyclohexyl-5-{4-[4-(2-methoxyphenyl)piperazin-1-...)
Show SMILES COc1ccccc1N1CCN(CCCCC2NC(=NNC2=O)C2CCCCC2)CC1 |c:19|
Show InChI InChI=1S/C24H37N5O2/c1-31-22-13-6-5-12-21(22)29-17-15-28(16-18-29)14-8-7-11-20-24(30)27-26-23(25-20)19-9-3-2-4-10-19/h5-6,12-13,19-20H,2-4,7-11,14-18H2,1H3,(H,25,26)(H,27,30)
Reactome pathway
20 -10.5n/an/an/an/an/an/a25
Jagiellonian University Medical College
Assay Description
All assays were incubated in a total volume of 200 mL in 96-well microtiter plates for 1 h at 37 °C, except for 5-HT1ARs which were incubated at room...
Chem Biol Drug Des 86: 697-703 (2015)
Article DOI: 10.1111/cbdd.12539
BindingDB Entry DOI: 10.7270/Q2DR2T86