BDBM163780 US9062070, 35::US9062070, 36
SMILES: Cc1c(ccc(F)c1[N+]#[C-])[C@H]1CN2CCN(C[C@H]2CO1)C(=O)C1CCc2cc(ncc12)-n1cnnn1
InChI Key: InChIKey=YSLZIEURPNRRMB-JJKBQAIRSA-N
Data: 4 IC50
Activity Spreadsheet -- Enzyme Inhibition Constant Data from BindingDB
Found 4 hits for monomerid = 163780
Trg + Lig
Ki
nM
ΔG°
kcal/mole
IC50
nM
Kd
nM
EC50/IC50
nM
koff
s-1
kon
M-1s-1
pHTemp
°C
Renal Outer Medullary Potassium (ROMK)
(Rattus norvegicus (Rat))
BDBM163780
(US9062070, 35 | US9062070, 36)
Show SMILES Cc1c(ccc(F)c1[N+]#[C-])[C@H]1CN2CCN(C[C@H]2CO1)C(=O)C1CCc2cc(ncc12)-n1cnnn1 |r|
Show InChI InChI=1S/C25H25FN8O2/c1-15-18(5-6-21(26)24(15)27-2)22-12-32-7-8-33(11-17(32)13-36-22)25(35)19-4-3-16-9-23(28-10-20(16)19)34-14-29-30-31-34/h5-6,9-10,14,17,19,22H,3-4,7-8,11-13H2,1H3/t17-,19?,22+/m0/s1
US Patent
n/an/a 110n/an/an/an/a7.4n/a
Merck Sharp & Dohme Corp.
US Patent
Assay Description
Block of Kir1.1 (ROMK1) currents was examined by whole cell voltage clamp (Hamill et. al. Pfluegers Archives 391:85-100 (1981)) using the IonWorks Qu...
US Patent US9062070 (2015)
BindingDB Entry DOI: 10.7270/Q2WQ02JX
Renal Outer Medullary Potassium (ROMK)
(Rattus norvegicus (Rat))
BDBM163780
(US9062070, 35 | US9062070, 36)
Show SMILES Cc1c(ccc(F)c1[N+]#[C-])[C@H]1CN2CCN(C[C@H]2CO1)C(=O)C1CCc2cc(ncc12)-n1cnnn1 |r|
Show InChI InChI=1S/C25H25FN8O2/c1-15-18(5-6-21(26)24(15)27-2)22-12-32-7-8-33(11-17(32)13-36-22)25(35)19-4-3-16-9-23(28-10-20(16)19)34-14-29-30-31-34/h5-6,9-10,14,17,19,22H,3-4,7-8,11-13H2,1H3/t17-,19?,22+/m0/s1
US Patent
n/an/a 660n/an/an/an/an/a37
Merck Sharp & Dohme Corp.
US Patent
Assay Description
The ROMK channel functional thallium flux assay is performed in 384 wells, using the FLIPR-Tetra instrument. HEK-hKir1.1 cells are seeded in Poly-D-L...
US Patent US9062070 (2015)
BindingDB Entry DOI: 10.7270/Q2WQ02JX
Renal Outer Medullary Potassium (ROMK)
(Rattus norvegicus (Rat))
BDBM163780
(US9062070, 35 | US9062070, 36)
Show SMILES Cc1c(ccc(F)c1[N+]#[C-])[C@H]1CN2CCN(C[C@H]2CO1)C(=O)C1CCc2cc(ncc12)-n1cnnn1 |r|
Show InChI InChI=1S/C25H25FN8O2/c1-15-18(5-6-21(26)24(15)27-2)22-12-32-7-8-33(11-17(32)13-36-22)25(35)19-4-3-16-9-23(28-10-20(16)19)34-14-29-30-31-34/h5-6,9-10,14,17,19,22H,3-4,7-8,11-13H2,1H3/t17-,19?,22+/m0/s1
US Patent
n/an/a 180n/an/an/an/an/a37
Merck Sharp & Dohme Corp.
US Patent
Assay Description
The ROMK channel functional thallium flux assay is performed in 384 wells, using the FLIPR-Tetra instrument. HEK-hKir1.1 cells are seeded in Poly-D-L...
US Patent US9062070 (2015)
BindingDB Entry DOI: 10.7270/Q2WQ02JX
Renal Outer Medullary Potassium (ROMK)
(Rattus norvegicus (Rat))
BDBM163780
(US9062070, 35 | US9062070, 36)
Show SMILES Cc1c(ccc(F)c1[N+]#[C-])[C@H]1CN2CCN(C[C@H]2CO1)C(=O)C1CCc2cc(ncc12)-n1cnnn1 |r|
Show InChI InChI=1S/C25H25FN8O2/c1-15-18(5-6-21(26)24(15)27-2)22-12-32-7-8-33(11-17(32)13-36-22)25(35)19-4-3-16-9-23(28-10-20(16)19)34-14-29-30-31-34/h5-6,9-10,14,17,19,22H,3-4,7-8,11-13H2,1H3/t17-,19?,22+/m0/s1
US Patent
n/an/a 140n/an/an/an/a7.4n/a
Merck Sharp & Dohme Corp.
US Patent
Assay Description
Block of Kir1.1 (ROMK1) currents was examined by whole cell voltage clamp (Hamill et. al. Pfluegers Archives 391:85-100 (1981)) using the IonWorks Qu...
US Patent US9062070 (2015)
BindingDB Entry DOI: 10.7270/Q2WQ02JX