BDBM16385 5-[3-(2-ethoxyphenyl)-[1,2,4]triazolo[3,4-a]pyridin-6-yl]-4-(4-fluorophenyl)-1,3-oxazole::triazolopyridine oxazole inhibitor 56
SMILES: CCOc1ccccc1-c1nnc2ccc(cn12)-c1ocnc1-c1ccc(F)cc1
InChI Key: InChIKey=XYWQAMREXZFVOE-UHFFFAOYSA-N
Data: 1 IC50
Activity Spreadsheet -- Enzyme Inhibition Constant Data from BindingDB
Found 1 hit for monomerid = 16385
Trg + Lig
Ki
nM
ΔG°
kcal/mole
IC50
nM
Kd
nM
EC50/IC50
nM
koff
s-1
kon
M-1s-1
pHTemp
°C
Mitogen-activated protein kinase 14
(Homo sapiens (Human))
BDBM16385
(5-[3-(2-ethoxyphenyl)-[1,2,4]triazolo[3,4-a]pyridi...)
Show SMILES CCOc1ccccc1-c1nnc2ccc(cn12)-c1ocnc1-c1ccc(F)cc1
Show InChI InChI=1S/C23H17FN4O2/c1-2-29-19-6-4-3-5-18(19)23-27-26-20-12-9-16(13-28(20)23)22-21(25-14-30-22)15-7-10-17(24)11-8-15/h3-14H,2H2,1H3
NCI pathway
Reactome pathway
n/an/a 0.400n/an/an/an/an/an/a
Pfizer
Assay Description
The IC50s were determined by incubating each test compound with activated p38-alpha in a 96-well plate that had been pre-treated with ATF-2-GST to al...
Bioorg Med Chem Lett 16: 4339-44 (2006)
Article DOI: 10.1016/j.bmcl.2006.05.056
BindingDB Entry DOI: 10.7270/Q2251GFZ