BDBM1641 2-ethyl-10-methyl-14-(trifluoromethyl)-2,4,10-triazatricyclo[9.4.0.0^{3,8}]pentadeca-1(11),3(8),4,6,12,14-hexaen-9-one::Pyridobenzodiazepinone deriv. 39
SMILES: CCN1c2cc(ccc2N(C)C(=O)c2cccnc12)C(F)(F)F
InChI Key: InChIKey=SNZNEMLKKGAZGA-UHFFFAOYSA-N
Data: 1 IC50
Activity Spreadsheet -- Enzyme Inhibition Constant Data from BindingDB
Found 1 hit for monomerid = 1641
Trg + Lig
Ki
nM
ΔG°
kcal/mole
IC50
nM
Kd
nM
EC50/IC50
nM
koff
s-1
kon
M-1s-1
pHTemp
°C
HIV-1 Reverse Transcriptase
(Human immunodeficiency virus type 1)
BDBM1641
(2-ethyl-10-methyl-14-(trifluoromethyl)-2,4,10-tria...)
Show SMILES CCN1c2cc(ccc2N(C)C(=O)c2cccnc12)C(F)(F)F
Show InChI InChI=1S/C16H14F3N3O/c1-3-22-13-9-10(16(17,18)19)6-7-12(13)21(2)15(23)11-5-4-8-20-14(11)22/h4-9H,3H2,1-2H3
n/an/a 230n/an/an/an/a7.822
Boehringer Ingelheim Pharmaceuticals Inc.
Assay Description
The IC50 of reverse transcriptase is the concentration that inhibits 50% of recombinant HIV-1 RT RNA-directed DNA polymerase activity in vitro.
J Med Chem 34: 2231-41 (1991)
Article DOI: 10.1021/jm00111a045
BindingDB Entry DOI: 10.7270/Q2TT4P4X