BDBM164404 US9066954, 18
SMILES: COc1ccc2c(OCc3nnc4ccc(cn34)-c3cn(C)nn3)ccnc2c1
InChI Key: InChIKey=HPNRWMFZEOBIAK-UHFFFAOYSA-N
Data: 1 KI
Activity Spreadsheet -- Enzyme Inhibition Constant Data from BindingDB
Found 1 hit for monomerid = 164404
Trg + Lig
Ki
nM
ΔG°
kcal/mole
IC50
nM
Kd
nM
EC50/IC50
nM
koff
s-1
kon
M-1s-1
pHTemp
°C
Hepatocyte growth factor receptor
(Homo sapiens (Human))
BDBM164404
(US9066954, 18)
Show SMILES COc1ccc2c(OCc3nnc4ccc(cn34)-c3cn(C)nn3)ccnc2c1
Show InChI InChI=1S/C20H17N7O2/c1-26-11-17(22-25-26)13-3-6-19-23-24-20(27(19)10-13)12-29-18-7-8-21-16-9-14(28-2)4-5-15(16)18/h3-11H,12H2,1-2H3
US Patent
6.60 -11.2n/an/an/an/an/a8.027
Amgen Inc.
US Patent
Assay Description
A PCR product covering residues 1058-1365 of c-Met (c-Met kinase domain) is generated from Human Liver QuickClone cDNA (Invitrogen) using forward pri...
US Patent US9066954 (2015)
BindingDB Entry DOI: 10.7270/Q2N878JD