BDBM164441 US9066954, 118
SMILES: COc1cnc2ccc(cc2c1)[C@H](C)c1nnc2ccc(nn12)-c1ccccc1
InChI Key: InChIKey=FGXLXJKDJXTYSR-HNNXBMFYSA-N
Data: 1 KI
Activity Spreadsheet -- Enzyme Inhibition Constant Data from BindingDB
Found 1 hit for monomerid = 164441
Trg + Lig
Ki
nM
ΔG°
kcal/mole
IC50
nM
Kd
nM
EC50/IC50
nM
koff
s-1
kon
M-1s-1
pHTemp
°C
Hepatocyte growth factor receptor
(Homo sapiens (Human))
BDBM164441
(US9066954, 118)
Show SMILES COc1cnc2ccc(cc2c1)[C@H](C)c1nnc2ccc(nn12)-c1ccccc1 |r|
Show InChI InChI=1S/C23H19N5O/c1-15(17-8-9-20-18(12-17)13-19(29-2)14-24-20)23-26-25-22-11-10-21(27-28(22)23)16-6-4-3-5-7-16/h3-15H,1-2H3/t15-/m0/s1
US Patent
2.60 -11.8n/an/an/an/an/a8.027
Amgen Inc.
US Patent
Assay Description
A PCR product covering residues 1058-1365 of c-Met (c-Met kinase domain) is generated from Human Liver QuickClone cDNA (Invitrogen) using forward pri...
US Patent US9066954 (2015)
BindingDB Entry DOI: 10.7270/Q2N878JD