BDBM164545 US9669029, 116 5,8-Dimethyl-2-[2-(1-methyl-4-pyrimidin-5-yl-1H-imidazol-2-yl)-ethyl]-[1,2,4]triazolo[1,5-a]pyrazine
SMILES: CC1=CN=C(C)C2NC(CCc3nc(cn3C)-c3cncnc3)=NN12
InChI Key: InChIKey=WBSHKQILYQHOGV-UHFFFAOYSA-N
Data: 1 IC50
Activity Spreadsheet -- Enzyme Inhibition Constant Data from BindingDB
Found 1 hit for monomerid = 164545
Trg + Lig
Ki
nM
ΔG°
kcal/mole
IC50
nM
Kd
nM
EC50/IC50
nM
koff
s-1
kon
M-1s-1
pHTemp
°C
PED10A
(Homo sapiens (Human))
BDBM164545
(US9669029, 116 5,8-Dimethyl-2-[2-(1-methyl-4-pyrim...)
Show SMILES CC1=CN=C(C)C2NC(CCc3nc(cn3C)-c3cncnc3)=NN12 |c:24,t:1,3|
Show InChI InChI=1S/C17H20N8/c1-11-6-20-12(2)17-22-15(23-25(11)17)4-5-16-21-14(9-24(16)3)13-7-18-10-19-8-13/h6-10,17H,4-5H2,1-3H3,(H,22,23)
US Patent
n/an/a 0.440n/an/an/an/an/a25
TBA
US Patent
Assay Description
The assay is performed in 60 uL samples containing a fixed amount of the relevant PDE enzyme (sufficient to convert 20-25% of the cyclic nucleotide s...
US Patent US9669029 (2017)
BindingDB Entry DOI: 10.7270/Q2BG2M4J