null
SMILES: OC(=O)Cn1cc(Cc2nc3c(F)c(F)cc(F)c3s2)c2cc(Cl)ccc12
InChI Key: InChIKey=WGSTWZUKTXSKQE-UHFFFAOYSA-N
Activity Spreadsheet -- Enzyme Inhibition Constant Data from BindingDB
Found 2 hits for monomerid = 16473
Trg + Lig
Ki
nM
ΔG°
kcal/mole
IC50
nM
Kd
nM
EC50/IC50
nM
koff
s-1
kon
M-1s-1
pHTemp
°C
Aldo-keto reductase family 1 member A1
(Homo sapiens (Human))
BDBM16473
(2-{5-chloro-3-[(4,5,7-trifluoro-1,3-benzothiazol-2...)
Show SMILES OC(=O)Cn1cc(Cc2nc3c(F)c(F)cc(F)c3s2)c2cc(Cl)ccc12
Show InChI InChI=1S/C18H10ClF3N2O2S/c19-9-1-2-13-10(4-9)8(6-24(13)7-15(25)26)3-14-23-17-16(22)11(20)5-12(21)18(17)27-14/h1-2,4-6H,3,7H2,(H,25,26)
n/an/a 1.10E+4n/an/an/an/an/an/a
The Institute for Diabetes Discovery
Assay Description
The activity of the test enzyme was determined spectrophotometrically by monitoring the change in absorbance at 340 nm, which is due to the disappear...
J Med Chem 48: 3141-52 (2005)
Article DOI: 10.1021/jm0492094
BindingDB Entry DOI: 10.7270/Q2J38QSN
Aldo-keto reductase family 1 member B1
(Homo sapiens (Human))
BDBM16473
(2-{5-chloro-3-[(4,5,7-trifluoro-1,3-benzothiazol-2...)
Show SMILES OC(=O)Cn1cc(Cc2nc3c(F)c(F)cc(F)c3s2)c2cc(Cl)ccc12
Show InChI InChI=1S/C18H10ClF3N2O2S/c19-9-1-2-13-10(4-9)8(6-24(13)7-15(25)26)3-14-23-17-16(22)11(20)5-12(21)18(17)27-14/h1-2,4-6H,3,7H2,(H,25,26)
n/an/a 10n/an/an/an/a6.637
The Institute for Diabetes Discovery
Assay Description
The activity of the test enzyme was determined spectrophotometrically by monitoring the change in absorbance at 340 nm, which is due to the disappear...
J Med Chem 48: 3141-52 (2005)
Article DOI: 10.1021/jm0492094
BindingDB Entry DOI: 10.7270/Q2J38QSN