BDBM164877 US10604504, Example 25::US9688629, 25::US9920031, Example 25
SMILES: CN(c1cccc(c1)-c1ccc(C(N)=O)c2[nH]c(C)c(C)c12)S(=O)(=O)C=C
InChI Key: InChIKey=RCPFXJSYEQFUSS-UHFFFAOYSA-N
Data: 5 IC50
Activity Spreadsheet -- Enzyme Inhibition Constant Data from BindingDB
Found 5 hits for monomerid = 164877
Trg + Lig
Ki
nM
ΔG°
kcal/mole
IC50
nM
Kd
nM
EC50/IC50
nM
koff
s-1
kon
M-1s-1
pHTemp
°C
Tyrosine-protein kinase BTK
(Homo sapiens (Human))
BDBM164877
(US10604504, Example 25 | US9688629, 25 | US9920031...)
Show SMILES CN(c1cccc(c1)-c1ccc(C(N)=O)c2[nH]c(C)c(C)c12)S(=O)(=O)C=C
Show InChI InChI=1S/C20H21N3O3S/c1-5-27(25,26)23(4)15-8-6-7-14(11-15)16-9-10-17(20(21)24)19-18(16)12(2)13(3)22-19/h5-11,22H,1H2,2-4H3,(H2,21,24)
NCI pathway
Reactome pathway
US Patent
n/an/a 0.0700n/an/an/an/a7.425
Bristol-Myers Squibb Company
US Patent
Assay Description
To V-bottom 384-well plates were added test compounds, human recombinant Btk (1 nM, Invitrogen Corporation), fluoresceinated peptide (1.5 μM), A...
US Patent US9688629 (2017)
BindingDB Entry DOI: 10.7270/Q20863G5
Tyrosine-protein kinase BTK
(Homo sapiens (Human))
BDBM164877
(US10604504, Example 25 | US9688629, 25 | US9920031...)
Show SMILES CN(c1cccc(c1)-c1ccc(C(N)=O)c2[nH]c(C)c(C)c12)S(=O)(=O)C=C
Show InChI InChI=1S/C20H21N3O3S/c1-5-27(25,26)23(4)15-8-6-7-14(11-15)16-9-10-17(20(21)24)19-18(16)12(2)13(3)22-19/h5-11,22H,1H2,2-4H3,(H2,21,24)
NCI pathway
Reactome pathway
US Patent
n/an/a 0.0700n/an/an/an/an/an/a
Montana State University
Assay Description
To V-bottom 384-well plates were added test compounds, human recombinant Btk (1 nM, Invitrogen Corporation), fluoresceinated peptide (1.5 μM), A...
J Med Chem 50: 4928-38 (2007)
BindingDB Entry DOI: 10.7270/Q2474D50
Tyrosine-protein kinase BTK
(Homo sapiens (Human))
BDBM164877
(US10604504, Example 25 | US9688629, 25 | US9920031...)
Show SMILES CN(c1cccc(c1)-c1ccc(C(N)=O)c2[nH]c(C)c(C)c12)S(=O)(=O)C=C
Show InChI InChI=1S/C20H21N3O3S/c1-5-27(25,26)23(4)15-8-6-7-14(11-15)16-9-10-17(20(21)24)19-18(16)12(2)13(3)22-19/h5-11,22H,1H2,2-4H3,(H2,21,24)
NCI pathway
Reactome pathway
US Patent
n/an/a 0.0700n/an/an/an/an/an/a
Bristol-Myers Squibb Company
US Patent
Assay Description
To V-bottom 384-well plates were added test compounds, human recombinant Btk (1 nM, Invitrogen Corporation), fluoresceinated peptide (1.5 μM), A...
US Patent US10604504 (2020)
Tyrosine-protein kinase BTK
(Homo sapiens (Human))
BDBM164877
(US10604504, Example 25 | US9688629, 25 | US9920031...)
Show SMILES CN(c1cccc(c1)-c1ccc(C(N)=O)c2[nH]c(C)c(C)c12)S(=O)(=O)C=C
Show InChI InChI=1S/C20H21N3O3S/c1-5-27(25,26)23(4)15-8-6-7-14(11-15)16-9-10-17(20(21)24)19-18(16)12(2)13(3)22-19/h5-11,22H,1H2,2-4H3,(H2,21,24)
NCI pathway
Reactome pathway
n/an/a 0.0680n/an/an/an/an/an/a
Bristol-Myers Squibb Company
Curated by ChEMBL
Assay Description
Inhibition of recombinant human full-length His-tagged BTK cytoplasmic domain expressed in baculovirus expression system using fluorescence-labelled ...
Bioorg Med Chem Lett 28: 3080-3084 (2018)
Article DOI: 10.1016/j.bmcl.2018.07.041
BindingDB Entry DOI: 10.7270/Q2NZ8B9C
Tyrosine-protein kinase BTK
(Homo sapiens (Human))
BDBM164877
(US10604504, Example 25 | US9688629, 25 | US9920031...)
Show SMILES CN(c1cccc(c1)-c1ccc(C(N)=O)c2[nH]c(C)c(C)c12)S(=O)(=O)C=C
Show InChI InChI=1S/C20H21N3O3S/c1-5-27(25,26)23(4)15-8-6-7-14(11-15)16-9-10-17(20(21)24)19-18(16)12(2)13(3)22-19/h5-11,22H,1H2,2-4H3,(H2,21,24)
NCI pathway
Reactome pathway
n/an/a 63n/an/an/an/an/an/a
Bristol-Myers Squibb Company
Curated by ChEMBL
Assay Description
Inhibition of BTK in human Ramos cells assessed as reduction in intracellular calcium level incubated for 1 hr measured for 180 secs by FLIPR assay
Bioorg Med Chem Lett 28: 3080-3084 (2018)
Article DOI: 10.1016/j.bmcl.2018.07.041
BindingDB Entry DOI: 10.7270/Q2NZ8B9C