BDBM16491 2-{7-methyl-3-[(4,5,7-trifluoro-1,3-benzothiazol-2-yl)methyl]-1H-indol-1-yl}acetic acid::Indoleacetic Acid Inhibitor 47
SMILES: Cc1cccc2c(Cc3nc4c(F)c(F)cc(F)c4s3)cn(CC(O)=O)c12
InChI Key: InChIKey=VKCHKAQCSBEZSI-UHFFFAOYSA-N
Data: 2 IC50
Activity Spreadsheet -- Enzyme Inhibition Constant Data from BindingDB
Found 2 hits for monomerid = 16491
Trg + Lig
Ki
nM
ΔG°
kcal/mole
IC50
nM
Kd
nM
EC50/IC50
nM
koff
s-1
kon
M-1s-1
pHTemp
°C
Aldo-keto reductase family 1 member A1
(Homo sapiens (Human))
BDBM16491
(2-{7-methyl-3-[(4,5,7-trifluoro-1,3-benzothiazol-2...)
Show SMILES Cc1cccc2c(Cc3nc4c(F)c(F)cc(F)c4s3)cn(CC(O)=O)c12
Show InChI InChI=1S/C19H13F3N2O2S/c1-9-3-2-4-11-10(7-24(18(9)11)8-15(25)26)5-14-23-17-16(22)12(20)6-13(21)19(17)27-14/h2-4,6-7H,5,8H2,1H3,(H,25,26)
n/an/a 2.10E+4n/an/an/an/an/an/a
The Institute for Diabetes Discovery
Assay Description
The activity of the test enzyme was determined spectrophotometrically by monitoring the change in absorbance at 340 nm, which is due to the disappear...
J Med Chem 48: 3141-52 (2005)
Article DOI: 10.1021/jm0492094
BindingDB Entry DOI: 10.7270/Q2J38QSN
Aldo-keto reductase family 1 member B1
(Homo sapiens (Human))
BDBM16491
(2-{7-methyl-3-[(4,5,7-trifluoro-1,3-benzothiazol-2...)
Show SMILES Cc1cccc2c(Cc3nc4c(F)c(F)cc(F)c4s3)cn(CC(O)=O)c12
Show InChI InChI=1S/C19H13F3N2O2S/c1-9-3-2-4-11-10(7-24(18(9)11)8-15(25)26)5-14-23-17-16(22)12(20)6-13(21)19(17)27-14/h2-4,6-7H,5,8H2,1H3,(H,25,26)
n/an/a 6n/an/an/an/an/an/a
The Institute for Diabetes Discovery
Assay Description
The activity of the test enzyme was determined spectrophotometrically by monitoring the change in absorbance at 340 nm, which is due to the disappear...
J Med Chem 48: 3141-52 (2005)
Article DOI: 10.1021/jm0492094
BindingDB Entry DOI: 10.7270/Q2J38QSN