BDBM164934 US10166239, Ex. 3-37-2::US9067914, Ex. 3-37-2
SMILES: COc1ccc(COc2ccc(Cn3c(N)nc4cc(cnc34)-c3ccn(C)n3)cc2OC)cn1
InChI Key: InChIKey=GUYRCSVNTIHWAI-UHFFFAOYSA-N
Data: 9 IC50
Activity Spreadsheet -- Enzyme Inhibition Constant Data from BindingDB
Found 9 hits for monomerid = 164934
Trg + Lig
Ki
nM
ΔG°
kcal/mole
IC50
nM
Kd
nM
EC50/IC50
nM
koff
s-1
kon
M-1s-1
pHTemp
°C
High affinity nerve growth factor receptor
(Homo sapiens (Human))
BDBM164934
(US10166239, Ex. 3-37-2 | US9067914, Ex. 3-37-2)
Show SMILES COc1ccc(COc2ccc(Cn3c(N)nc4cc(cnc34)-c3ccn(C)n3)cc2OC)cn1
Show InChI InChI=1S/C25H25N7O3/c1-31-9-8-19(30-31)18-11-20-24(28-13-18)32(25(26)29-20)14-16-4-6-21(22(10-16)33-2)35-15-17-5-7-23(34-3)27-12-17/h4-13H,14-15H2,1-3H3,(H2,26,29)
US Patent
n/an/a 3n/an/an/an/a7.525
Genzyme Corporation
US Patent
Assay Description
Reagents and consumables were purchased from Sigma Aldrich, Carna Biosciences, or Caliper Life Sciences. All assay reaction conditions for IC50 deter...
US Patent US9067914 (2015)
BindingDB Entry DOI: 10.7270/Q28051CB
BDNF/NT-3 growth factors receptor
(Homo sapiens (Human))
BDBM164934
(US10166239, Ex. 3-37-2 | US9067914, Ex. 3-37-2)
Show SMILES COc1ccc(COc2ccc(Cn3c(N)nc4cc(cnc34)-c3ccn(C)n3)cc2OC)cn1
Show InChI InChI=1S/C25H25N7O3/c1-31-9-8-19(30-31)18-11-20-24(28-13-18)32(25(26)29-20)14-16-4-6-21(22(10-16)33-2)35-15-17-5-7-23(34-3)27-12-17/h4-13H,14-15H2,1-3H3,(H2,26,29)
US Patent
n/an/a 2n/an/an/an/a7.525
Genzyme Corporation
US Patent
Assay Description
Reagents and consumables were purchased from Sigma Aldrich, Carna Biosciences, or Caliper Life Sciences. All assay reaction conditions for IC50 deter...
US Patent US9067914 (2015)
BindingDB Entry DOI: 10.7270/Q28051CB
Macrophage colony stimulating factor receptor
(Homo sapiens (Human))
BDBM164934
(US10166239, Ex. 3-37-2 | US9067914, Ex. 3-37-2)
Show SMILES COc1ccc(COc2ccc(Cn3c(N)nc4cc(cnc34)-c3ccn(C)n3)cc2OC)cn1
Show InChI InChI=1S/C25H25N7O3/c1-31-9-8-19(30-31)18-11-20-24(28-13-18)32(25(26)29-20)14-16-4-6-21(22(10-16)33-2)35-15-17-5-7-23(34-3)27-12-17/h4-13H,14-15H2,1-3H3,(H2,26,29)
US Patent
n/an/a 5n/an/an/an/a7.525
Genzyme Corporation
US Patent
Assay Description
Reagents and consumables were purchased from Sigma Aldrich, Carna Biosciences, or Caliper Life Sciences. All assay reaction conditions for IC50 deter...
US Patent US9067914 (2015)
BindingDB Entry DOI: 10.7270/Q28051CB
High affinity nerve growth factor receptor
(Homo sapiens (Human))
BDBM164934
(US10166239, Ex. 3-37-2 | US9067914, Ex. 3-37-2)
Show SMILES COc1ccc(COc2ccc(Cn3c(N)nc4cc(cnc34)-c3ccn(C)n3)cc2OC)cn1
Show InChI InChI=1S/C25H25N7O3/c1-31-9-8-19(30-31)18-11-20-24(28-13-18)32(25(26)29-20)14-16-4-6-21(22(10-16)33-2)35-15-17-5-7-23(34-3)27-12-17/h4-13H,14-15H2,1-3H3,(H2,26,29)
US Patent
n/an/a 3n/an/an/an/an/an/a
Genzyme Corporation
US Patent
Assay Description
In a 384 well polypropylene plate, TrkA (0.4 nM, Carna 08-186) was pre-incubated in a 100 mM Hepes-NaOH pH 7.5 buffer containing 0.01% Triton X-100, ...
US Patent US10166239 (2019)
BindingDB Entry DOI: 10.7270/Q2WW7KSN
Macrophage colony stimulating factor receptor
(Homo sapiens (Human))
BDBM164934
(US10166239, Ex. 3-37-2 | US9067914, Ex. 3-37-2)
Show SMILES COc1ccc(COc2ccc(Cn3c(N)nc4cc(cnc34)-c3ccn(C)n3)cc2OC)cn1
Show InChI InChI=1S/C25H25N7O3/c1-31-9-8-19(30-31)18-11-20-24(28-13-18)32(25(26)29-20)14-16-4-6-21(22(10-16)33-2)35-15-17-5-7-23(34-3)27-12-17/h4-13H,14-15H2,1-3H3,(H2,26,29)
US Patent
n/an/a 5n/an/an/an/an/an/a
GENZYME CORPORATION
US Patent
Assay Description
Reagents and consumables were purchased from Sigma Aldrich, Carna Biosciences, or Caliper Life Sciences. All assay reaction conditions for IC50 deter...
US Patent US9611265 (2017)
BindingDB Entry DOI: 10.7270/Q2S184KD
Macrophage colony stimulating factor receptor
(Homo sapiens (Human))
BDBM164934
(US10166239, Ex. 3-37-2 | US9067914, Ex. 3-37-2)
Show SMILES COc1ccc(COc2ccc(Cn3c(N)nc4cc(cnc34)-c3ccn(C)n3)cc2OC)cn1
Show InChI InChI=1S/C25H25N7O3/c1-31-9-8-19(30-31)18-11-20-24(28-13-18)32(25(26)29-20)14-16-4-6-21(22(10-16)33-2)35-15-17-5-7-23(34-3)27-12-17/h4-13H,14-15H2,1-3H3,(H2,26,29)
US Patent
n/an/a 5n/an/an/an/an/an/a
Genzyme Corporation
US Patent
Assay Description
In a 384 well polypropylene plate, c-FMS (0.14 nM, Carna 08-155) was pre-incubated in a 100 mM Hepes-NaOH pH 7.5 buffer containing 0.01% Triton X-100...
US Patent US10166239 (2019)
BindingDB Entry DOI: 10.7270/Q2WW7KSN
High affinity nerve growth factor receptor
(Homo sapiens (Human))
BDBM164934
(US10166239, Ex. 3-37-2 | US9067914, Ex. 3-37-2)
Show SMILES COc1ccc(COc2ccc(Cn3c(N)nc4cc(cnc34)-c3ccn(C)n3)cc2OC)cn1
Show InChI InChI=1S/C25H25N7O3/c1-31-9-8-19(30-31)18-11-20-24(28-13-18)32(25(26)29-20)14-16-4-6-21(22(10-16)33-2)35-15-17-5-7-23(34-3)27-12-17/h4-13H,14-15H2,1-3H3,(H2,26,29)
US Patent
n/an/a 3n/an/an/an/an/an/a
GENZYME CORPORATION
US Patent
Assay Description
Reagents and consumables were purchased from Sigma Aldrich, Carna Biosciences, or Caliper Life Sciences. All assay reaction conditions for IC50 deter...
US Patent US9611265 (2017)
BindingDB Entry DOI: 10.7270/Q2S184KD
BDNF/NT-3 growth factors receptor
(Homo sapiens (Human))
BDBM164934
(US10166239, Ex. 3-37-2 | US9067914, Ex. 3-37-2)
Show SMILES COc1ccc(COc2ccc(Cn3c(N)nc4cc(cnc34)-c3ccn(C)n3)cc2OC)cn1
Show InChI InChI=1S/C25H25N7O3/c1-31-9-8-19(30-31)18-11-20-24(28-13-18)32(25(26)29-20)14-16-4-6-21(22(10-16)33-2)35-15-17-5-7-23(34-3)27-12-17/h4-13H,14-15H2,1-3H3,(H2,26,29)
US Patent
n/an/a 2n/an/an/an/an/an/a
GENZYME CORPORATION
US Patent
Assay Description
Reagents and consumables were purchased from Sigma Aldrich, Carna Biosciences, or Caliper Life Sciences. All assay reaction conditions for IC50 deter...
US Patent US9611265 (2017)
BindingDB Entry DOI: 10.7270/Q2S184KD
BDNF/NT-3 growth factors receptor
(Homo sapiens (Human))
BDBM164934
(US10166239, Ex. 3-37-2 | US9067914, Ex. 3-37-2)
Show SMILES COc1ccc(COc2ccc(Cn3c(N)nc4cc(cnc34)-c3ccn(C)n3)cc2OC)cn1
Show InChI InChI=1S/C25H25N7O3/c1-31-9-8-19(30-31)18-11-20-24(28-13-18)32(25(26)29-20)14-16-4-6-21(22(10-16)33-2)35-15-17-5-7-23(34-3)27-12-17/h4-13H,14-15H2,1-3H3,(H2,26,29)
US Patent
n/an/a 2n/an/an/an/an/an/a
Genzyme Corporation
US Patent
Assay Description
In a 384 well polypropylene plate, TrkB (0.6 nM, Carna 08-187) was pre-incubated in a 100 mM Hepes-NaOH pH 7.5 buffer containing 0.01% Triton X-100, ...
US Patent US10166239 (2019)
BindingDB Entry DOI: 10.7270/Q2WW7KSN