BDBM16499 (2S)-2-[(2S,3S)-2-{[(2S,3S)-3-(ethoxycarbonyl)oxiran-2-yl]formamido}-3-methylpentanamido]propanoic acid::CA inhibitor 2::CA075::EtO-tES-Ile-Ala-OH::N-{[(2S,3S)-3-(ethoxycarbonyl)oxiran-2-yl]carbonyl}-L-isoleucyl-L-alanine::epoxysuccinyl derivative 2
SMILES: [H][C@@]1(O[C@]1([H])C(=O)OCC)C(=O)N[C@@H]([C@@H](C)CC)C(=O)N[C@@H](C)C(O)=O
InChI Key: InChIKey=FCCIQOJEDMDETP-QHZLYTNSSA-N
Data: 1 IC50
PDB links: 1 PDB ID matches this monomer. 1 PDB ID contains this monomer as substructures. 1 PDB ID contains inhibitors having a similarity of 90% to this monomer.
Activity Spreadsheet -- Enzyme Inhibition Constant Data from BindingDB
Found 1 hit for monomerid = 16499
Trg + Lig
Ki
nM
ΔG°
kcal/mole
IC50
nM
Kd
nM
EC50/IC50
nM
koff
s-1
kon
M-1s-1
pHTemp
°C
Cathepsin B
(Bos taurus (bovine))
BDBM16499
((2S)-2-[(2S,3S)-2-{[(2S,3S)-3-(ethoxycarbonyl)oxir...)
Show SMILES [H][C@@]1(O[C@]1([H])C(=O)OCC)C(=O)N[C@@H]([C@@H](C)CC)C(=O)N[C@@H](C)C(O)=O |r|
Show InChI InChI=1S/C15H24N2O7/c1-5-7(3)9(12(18)16-8(4)14(20)21)17-13(19)10-11(24-10)15(22)23-6-2/h7-11H,5-6H2,1-4H3,(H,16,18)(H,17,19)(H,20,21)/t7-,8-,9-,10-,11-/m0/s1
Reactome pathway
n/an/a 23n/an/an/an/a6.040
Osaka University of Pharmaceutical Sciences
Assay Description
Inhibitory activities (IC50, concentration of 50% inhibition) of compounds for bovine CB in vitro were determined by monitoring the cleavage of fluor...
J Mol Biol 362: 979-93 (2006)
Article DOI: 10.1016/j.jmb.2006.07.070
BindingDB Entry DOI: 10.7270/Q2DF6PGN
3D
3D Structure (crystal)