BDBM165190 2-Methoxy-4-((8-methylnonanamido)methyl)phenyl dihydrogen phosphate (3a)
SMILES: COc1cc(CNC(=O)CCCCCCC(C)C)ccc1OP(O)(O)=O
InChI Key: InChIKey=QCYCICLIXDKYOO-UHFFFAOYSA-N
Data: 1 KI  1 IC50
Activity Spreadsheet -- Enzyme Inhibition Constant Data from BindingDB
Found 1 hit for monomerid = 165190
Trg + Lig
Ki
nM
ΔG°
kcal/mole
IC50
nM
Kd
nM
EC50/IC50
nM
koff
s-1
kon
M-1s-1
pHTemp
°C
Transcription factor STAT5a (STAT5a)
(Homo sapiens (Human))
BDBM165190
(2-Methoxy-4-((8-methylnonanamido)methyl)phenyl dih...)
Show SMILES COc1cc(CNC(=O)CCCCCCC(C)C)ccc1OP(O)(O)=O
Show InChI InChI=1S/C18H30NO6P/c1-14(2)8-6-4-5-7-9-18(20)19-13-15-10-11-16(17(12-15)24-3)25-26(21,22)23/h10-12,14H,4-9,13H2,1-3H3,(H,19,20)(H2,21,22,23)
7.50E+4n/a 1.52E+5n/an/an/an/an/an/a
University of Leipzig
Assay Description
For competition-based fluorescence polarization assays, the ability of the test compounds to displace fluorophore-labeled peptides from their respect...
ACS Chem Biol 10: 2884-90 (2015)
Article DOI: 10.1021/acschembio.5b00817
BindingDB Entry DOI: 10.7270/Q2P55M8G