BDBM165193 4-(Nonanamidomethyl)-1,2-phenylene bis(dihydrogen phosphate) (6b)
SMILES: CCCCCCCCC(=O)NCc1ccc(OP(O)(O)=O)c(OP(O)(O)=O)c1
InChI Key: InChIKey=LOLWKWOOTKIJHJ-UHFFFAOYSA-N
Data: 2 KI  2 IC50
Activity Spreadsheet -- Enzyme Inhibition Constant Data from BindingDB
Found 2 hits for monomerid = 165193
Trg + Lig
Ki
nM
ΔG°
kcal/mole
IC50
nM
Kd
nM
EC50/IC50
nM
koff
s-1
kon
M-1s-1
pHTemp
°C
Transcription factor STAT5b (STAT5b)
(Homo sapiens (Human))
BDBM165193
(4-(Nonanamidomethyl)-1,2-phenylene bis(dihydrogen ...)
Show SMILES CCCCCCCCC(=O)NCc1ccc(OP(O)(O)=O)c(OP(O)(O)=O)c1
Show InChI InChI=1S/C16H27NO9P2/c1-2-3-4-5-6-7-8-16(18)17-12-13-9-10-14(25-27(19,20)21)15(11-13)26-28(22,23)24/h9-11H,2-8,12H2,1H3,(H,17,18)(H2,19,20,21)(H2,22,23,24)
390n/a 860n/an/an/an/an/an/a
University of Leipzig
Assay Description
For competition-based fluorescence polarization assays, the ability of the test compounds to displace fluorophore-labeled peptides from their respect...
ACS Chem Biol 10: 2884-90 (2015)
Article DOI: 10.1021/acschembio.5b00817
BindingDB Entry DOI: 10.7270/Q2P55M8G
Transcription factor STAT5a (STAT5a)
(Homo sapiens (Human))
BDBM165193
(4-(Nonanamidomethyl)-1,2-phenylene bis(dihydrogen ...)
Show SMILES CCCCCCCCC(=O)NCc1ccc(OP(O)(O)=O)c(OP(O)(O)=O)c1
Show InChI InChI=1S/C16H27NO9P2/c1-2-3-4-5-6-7-8-16(18)17-12-13-9-10-14(25-27(19,20)21)15(11-13)26-28(22,23)24/h9-11H,2-8,12H2,1H3,(H,17,18)(H2,19,20,21)(H2,22,23,24)
1.23E+4n/a 2.49E+4n/an/an/an/an/an/a
University of Leipzig
Assay Description
For competition-based fluorescence polarization assays, the ability of the test compounds to displace fluorophore-labeled peptides from their respect...
ACS Chem Biol 10: 2884-90 (2015)
Article DOI: 10.1021/acschembio.5b00817
BindingDB Entry DOI: 10.7270/Q2P55M8G