BDBM16521 2-arylpyridazin-3-one, 27::6-[(2-chloro-4-fluorophenyl)(2-hydroxyethyl)amino]-2-(2-chlorophenyl)-2,3-dihydropyridazin-3-one
SMILES: OCCN(c1ccc(=O)n(n1)-c1ccccc1Cl)c1ccc(F)cc1Cl
InChI Key: InChIKey=SSVPNEAXULRSCF-UHFFFAOYSA-N
Data: 2 IC50
Activity Spreadsheet -- Enzyme Inhibition Constant Data from BindingDB
Found 2 hits for monomerid = 16521
Trg + Lig
Ki
nM
ΔG°
kcal/mole
IC50
nM
Kd
nM
EC50/IC50
nM
koff
s-1
kon
M-1s-1
pHTemp
°C
MAP Kinase p38 beta
(Mus musculus (mouse))
BDBM16521
(2-arylpyridazin-3-one, 27 | 6-[(2-chloro-4-fluorop...)
Show SMILES OCCN(c1ccc(=O)n(n1)-c1ccccc1Cl)c1ccc(F)cc1Cl
Show InChI InChI=1S/C18H14Cl2FN3O2/c19-13-3-1-2-4-16(13)24-18(26)8-7-17(22-24)23(9-10-25)15-6-5-12(21)11-14(15)20/h1-8,11,25H,9-10H2
Reactome pathway
n/an/a 135n/an/an/an/an/an/a
Merck Research Laboratories
Assay Description
The biochemical activity of compounds was determined by incubation with p38 enzyme, and substrates in the presence ATP/[gamma-33P] ATP. After the rea...
Bioorg Med Chem Lett 16: 5809-13 (2006)
Article DOI: 10.1016/j.bmcl.2006.08.074
BindingDB Entry DOI: 10.7270/Q28P5XSC
MAP kinase p38
(Mus musculus (mouse))
BDBM16521
(2-arylpyridazin-3-one, 27 | 6-[(2-chloro-4-fluorop...)
Show SMILES OCCN(c1ccc(=O)n(n1)-c1ccccc1Cl)c1ccc(F)cc1Cl
Show InChI InChI=1S/C18H14Cl2FN3O2/c19-13-3-1-2-4-16(13)24-18(26)8-7-17(22-24)23(9-10-25)15-6-5-12(21)11-14(15)20/h1-8,11,25H,9-10H2
Reactome pathway
n/an/a 168n/an/an/an/a7.030
Merck Research Laboratories
Assay Description
The biochemical activity of compounds was determined by incubation with p38 enzyme, and substrates in the presence ATP/[gamma-33P] ATP. After the rea...
Bioorg Med Chem Lett 16: 5809-13 (2006)
Article DOI: 10.1016/j.bmcl.2006.08.074
BindingDB Entry DOI: 10.7270/Q28P5XSC