BDBM16554 (2S)-1-(4-bromo-2-fluorophenyl)-3-{[5-(3-methyl-1H-indazol-5-yl)pyridin-3-yl]oxy}propan-2-amine::5-{5-[(2S)-2-amino-3-(4-bromo-2-fluorophenyl)propoxy]pyridin-3-yl}-3-methyl-1H-indazole::indazole-pyridine, 13s
SMILES: Cc1n[nH]c2ccc(cc12)-c1cncc(OC[C@@H](N)Cc2ccc(Br)cc2F)c1
InChI Key: InChIKey=FBBATXLXZFQRAQ-SFHVURJKSA-N
Data: 1 IC50
Activity Spreadsheet -- Enzyme Inhibition Constant Data from BindingDB
Found 1 hit for monomerid = 16554
Trg + Lig
Ki
nM
ΔG°
kcal/mole
IC50
nM
Kd
nM
EC50/IC50
nM
koff
s-1
kon
M-1s-1
pHTemp
°C
Protein kinase B (Akt 1)
(Homo sapiens (Human))
BDBM16554
((2S)-1-(4-bromo-2-fluorophenyl)-3-{[5-(3-methyl-1H...)
Show SMILES Cc1n[nH]c2ccc(cc12)-c1cncc(OC[C@@H](N)Cc2ccc(Br)cc2F)c1 |r|
Show InChI InChI=1S/C22H20BrFN4O/c1-13-20-8-14(3-5-22(20)28-27-13)16-7-19(11-26-10-16)29-12-18(25)6-15-2-4-17(23)9-21(15)24/h2-5,7-11,18H,6,12,25H2,1H3,(H,27,28)/t18-/m0/s1
n/an/a 10n/an/an/an/an/an/a
Abbott Laboratories
Assay Description
The kinase assay uses His-Akt1 and a biotinylated peptide as substrate. The biotinylated peptides were immobilized on streptavidin-coated FLASH plat...
J Med Chem 50: 2990-3003 (2007)
Article DOI: 10.1021/jm0701019
BindingDB Entry DOI: 10.7270/Q24X562F