null
SMILES: Cc1n[nH]c2ccc(cc12)-c1cncc(OC[C@@H](N)Cc2cc(F)ccc2C)c1
InChI Key: InChIKey=QYMKAFLUGMIEQN-FQEVSTJZSA-N
Activity Spreadsheet -- Enzyme Inhibition Constant Data from BindingDB
Found 1 hit for monomerid = 16557
Trg + Lig
Ki
nM
ΔG°
kcal/mole
IC50
nM
Kd
nM
EC50/IC50
nM
koff
s-1
kon
M-1s-1
pHTemp
°C
RAC-alpha serine/threonine-protein kinase [139-480,S378A,S381A,T450D,S473D]
(Homo sapiens (Human))
BDBM16557
((2S)-1-(5-fluoro-2-methylphenyl)-3-{[5-(3-methyl-1...)
Show SMILES Cc1n[nH]c2ccc(cc12)-c1cncc(OC[C@@H](N)Cc2cc(F)ccc2C)c1 |r|
Show InChI InChI=1S/C23H23FN4O/c1-14-3-5-19(24)7-17(14)8-20(25)13-29-21-9-18(11-26-12-21)16-4-6-23-22(10-16)15(2)27-28-23/h3-7,9-12,20H,8,13,25H2,1-2H3,(H,27,28)/t20-/m0/s1
n/an/a 3.90n/an/an/an/an/an/a
Abbott Laboratories
Assay Description
The kinase assay uses His-Akt1 and a biotinylated peptide as substrate. The biotinylated peptides were immobilized on streptavidin-coated FLASH plat...
J Med Chem 50: 2990-3003 (2007)
Article DOI: 10.1021/jm0701019
BindingDB Entry DOI: 10.7270/Q24X562F