null
SMILES: Cc1n[nH]c2ccc(cc12)-c1cncc(OC[C@@H](N)Cc2ccc(cc2F)C(F)(F)F)c1
InChI Key: InChIKey=ARZSIDJLTVASAU-SFHVURJKSA-N
Activity Spreadsheet -- Enzyme Inhibition Constant Data from BindingDB
Found 1 hit for monomerid = 16571
Trg + Lig
Ki
nM
ΔG°
kcal/mole
IC50
nM
Kd
nM
EC50/IC50
nM
koff
s-1
kon
M-1s-1
pHTemp
°C
RAC-alpha serine/threonine-protein kinase [139-480,S378A,S381A,T450D,S473D]
(Homo sapiens (Human))
BDBM16571
((2S)-1-[2-fluoro-4-(trifluoromethyl)phenyl]-3-{[5-...)
Show SMILES Cc1n[nH]c2ccc(cc12)-c1cncc(OC[C@@H](N)Cc2ccc(cc2F)C(F)(F)F)c1 |r|
Show InChI InChI=1S/C23H20F4N4O/c1-13-20-8-14(3-5-22(20)31-30-13)16-7-19(11-29-10-16)32-12-18(28)6-15-2-4-17(9-21(15)24)23(25,26)27/h2-5,7-11,18H,6,12,28H2,1H3,(H,30,31)/t18-/m0/s1
n/an/a 12.1n/an/an/an/an/an/a
Abbott Laboratories
Assay Description
The kinase assay uses His-Akt1 and a biotinylated peptide as substrate. The biotinylated peptides were immobilized on streptavidin-coated FLASH plat...
J Med Chem 50: 2990-3003 (2007)
Article DOI: 10.1021/jm0701019
BindingDB Entry DOI: 10.7270/Q24X562F