BDBM165908 US9067924, 2
SMILES: C[C@]1(CCSCC(N)=N1)c1cc(NC(=O)c2ccc(F)cn2)ccc1F
InChI Key: InChIKey=AXFRJARLOWBARG-SFHVURJKSA-N
Data: 2 IC50
Activity Spreadsheet -- Enzyme Inhibition Constant Data from BindingDB
Found 2 hits for monomerid = 165908
Trg + Lig
Ki
nM
ΔG°
kcal/mole
IC50
nM
Kd
nM
EC50/IC50
nM
koff
s-1
kon
M-1s-1
pHTemp
°C
Beta-secretase 1 (BACE1)
(Mus musculus (Mouse))
BDBM165908
(US9067924, 2)
Show SMILES C[C@]1(CCSCC(N)=N1)c1cc(NC(=O)c2ccc(F)cn2)ccc1F |r,c:7|
Show InChI InChI=1S/C18H18F2N4OS/c1-18(6-7-26-10-16(21)24-18)13-8-12(3-4-14(13)20)23-17(25)15-5-2-11(19)9-22-15/h2-5,8-9H,6-7,10H2,1H3,(H2,21,24)(H,23,25)/t18-/m0/s1
US Patent
n/an/a 16n/an/an/an/an/an/a
HOFFMANN-LA ROCHE INC.
US Patent
Assay Description
An ELISA assay (using a pair of mouse anti-human-TMEM27 antibodies, raised against the extracellular domain of TMEM27) is used for detection of TMEM2...
US Patent US9067924 (2015)
BindingDB Entry DOI: 10.7270/Q2R21049
Beta-secretase 2 (BACE2)
(Mus musculus (Mouse))
BDBM165908
(US9067924, 2)
Show SMILES C[C@]1(CCSCC(N)=N1)c1cc(NC(=O)c2ccc(F)cn2)ccc1F |r,c:7|
Show InChI InChI=1S/C18H18F2N4OS/c1-18(6-7-26-10-16(21)24-18)13-8-12(3-4-14(13)20)23-17(25)15-5-2-11(19)9-22-15/h2-5,8-9H,6-7,10H2,1H3,(H2,21,24)(H,23,25)/t18-/m0/s1
US Patent
n/an/a 79n/an/an/an/an/an/a
HOFFMANN-LA ROCHE INC.
US Patent
Assay Description
An ELISA assay (using a pair of mouse anti-human-TMEM27 antibodies, raised against the extracellular domain of TMEM27) is used for detection of TMEM2...
US Patent US9067924 (2015)
BindingDB Entry DOI: 10.7270/Q2R21049