BDBM165912 US9067924, 6
SMILES: CC1SCC[C@](C)(N=C1N)c1cc(NC(=O)c2ccc(Cl)cn2)ccc1F
InChI Key: InChIKey=DURSUKKEHOKMQQ-OWRIGNJKSA-N
Data: 2 IC50
Activity Spreadsheet -- Enzyme Inhibition Constant Data from BindingDB
Found 2 hits for monomerid = 165912
Trg + Lig
Ki
nM
ΔG°
kcal/mole
IC50
nM
Kd
nM
EC50/IC50
nM
koff
s-1
kon
M-1s-1
pHTemp
°C
Beta-secretase 1 (BACE1)
(Mus musculus (Mouse))
BDBM165912
(US9067924, 6)
Show SMILES CC1SCC[C@](C)(N=C1N)c1cc(NC(=O)c2ccc(Cl)cn2)ccc1F |r,c:7|
Show InChI InChI=1S/C19H20ClFN4OS/c1-11-17(22)25-19(2,7-8-27-11)14-9-13(4-5-15(14)21)24-18(26)16-6-3-12(20)10-23-16/h3-6,9-11H,7-8H2,1-2H3,(H2,22,25)(H,24,26)/t11?,19-/m0/s1
US Patent
n/an/a 140n/an/an/an/an/an/a
HOFFMANN-LA ROCHE INC.
US Patent
Assay Description
An ELISA assay (using a pair of mouse anti-human-TMEM27 antibodies, raised against the extracellular domain of TMEM27) is used for detection of TMEM2...
US Patent US9067924 (2015)
BindingDB Entry DOI: 10.7270/Q2R21049
Beta-secretase 2 (BACE2)
(Mus musculus (Mouse))
BDBM165912
(US9067924, 6)
Show SMILES CC1SCC[C@](C)(N=C1N)c1cc(NC(=O)c2ccc(Cl)cn2)ccc1F |r,c:7|
Show InChI InChI=1S/C19H20ClFN4OS/c1-11-17(22)25-19(2,7-8-27-11)14-9-13(4-5-15(14)21)24-18(26)16-6-3-12(20)10-23-16/h3-6,9-11H,7-8H2,1-2H3,(H2,22,25)(H,24,26)/t11?,19-/m0/s1
US Patent
n/an/a 9n/an/an/an/an/an/a
HOFFMANN-LA ROCHE INC.
US Patent
Assay Description
An ELISA assay (using a pair of mouse anti-human-TMEM27 antibodies, raised against the extracellular domain of TMEM27) is used for detection of TMEM2...
US Patent US9067924 (2015)
BindingDB Entry DOI: 10.7270/Q2R21049