BDBM166196 US9067949, 53
SMILES: Cc1cc(cc2c3CNCCc3oc12)S(=O)(=O)c1ccccc1
InChI Key: InChIKey=VZVAASVJYKVURR-UHFFFAOYSA-N
Data: 1 KI
Activity Spreadsheet -- Enzyme Inhibition Constant Data from BindingDB
Found 1 hit for monomerid = 166196
Trg + Lig
Ki
nM
ΔG°
kcal/mole
IC50
nM
Kd
nM
EC50/IC50
nM
koff
s-1
kon
M-1s-1
pHTemp
°C
5-hydroxytryptamine receptor 6
(Homo sapiens (Human))
BDBM166196
(US9067949, 53)
Show SMILES Cc1cc(cc2c3CNCCc3oc12)S(=O)(=O)c1ccccc1
Show InChI InChI=1S/C18H17NO3S/c1-12-9-14(23(20,21)13-5-3-2-4-6-13)10-15-16-11-19-8-7-17(16)22-18(12)15/h2-6,9-10,19H,7-8,11H2,1H3
Reactome pathway
US Patent
0.220 -13.2n/an/an/an/an/a7.525
Albany Molecular Research, Inc.
US Patent
Assay Description
For binding analysis vs. the human receptor, samples were incubated in 50 mM Tris-HCl, pH 7.5, 5 mM MgCl2, 1 mM EDTA (4% DMSO final) with 10 nM [N-me...
US Patent US9067949 (2015)
BindingDB Entry DOI: 10.7270/Q23777FB