BDBM166309 US9067949, 166
SMILES: COc1cc(cc2c3CNCCc3oc12)S(=O)(=O)c1cccc(F)c1
InChI Key: InChIKey=YCTUXWAAVAKJHR-UHFFFAOYSA-N
Data: 1 KI
Activity Spreadsheet -- Enzyme Inhibition Constant Data from BindingDB
Found 1 hit for monomerid = 166309
Trg + Lig
Ki
nM
ΔG°
kcal/mole
IC50
nM
Kd
nM
EC50/IC50
nM
koff
s-1
kon
M-1s-1
pHTemp
°C
5-hydroxytryptamine receptor 6
(Homo sapiens (Human))
BDBM166309
(US9067949, 166)
Show SMILES COc1cc(cc2c3CNCCc3oc12)S(=O)(=O)c1cccc(F)c1
Show InChI InChI=1S/C18H16FNO4S/c1-23-17-9-13(25(21,22)12-4-2-3-11(19)7-12)8-14-15-10-20-6-5-16(15)24-18(14)17/h2-4,7-9,20H,5-6,10H2,1H3
Reactome pathway
US Patent
0.200 -13.2n/an/an/an/an/a7.525
Albany Molecular Research, Inc.
US Patent
Assay Description
For binding analysis vs. the human receptor, samples were incubated in 50 mM Tris-HCl, pH 7.5, 5 mM MgCl2, 1 mM EDTA (4% DMSO final) with 10 nM [N-me...
US Patent US9067949 (2015)
BindingDB Entry DOI: 10.7270/Q23777FB