BDBM166344 US9067949, 201
SMILES: Cc1cc(cc2c3CNCCc3oc12)S(=O)(=O)c1cccc(c1)C(F)(F)F
InChI Key: InChIKey=NNXSQSVMNHMDQS-UHFFFAOYSA-N
Data: 1 KI
Activity Spreadsheet -- Enzyme Inhibition Constant Data from BindingDB
Found 1 hit for monomerid = 166344
Trg + Lig
Ki
nM
ΔG°
kcal/mole
IC50
nM
Kd
nM
EC50/IC50
nM
koff
s-1
kon
M-1s-1
pHTemp
°C
5-hydroxytryptamine receptor 6
(Homo sapiens (Human))
BDBM166344
(US9067949, 201)
Show SMILES Cc1cc(cc2c3CNCCc3oc12)S(=O)(=O)c1cccc(c1)C(F)(F)F
Show InChI InChI=1S/C19H16F3NO3S/c1-11-7-14(9-15-16-10-23-6-5-17(16)26-18(11)15)27(24,25)13-4-2-3-12(8-13)19(20,21)22/h2-4,7-9,23H,5-6,10H2,1H3
Reactome pathway
US Patent
0.220 -13.2n/an/an/an/an/a7.525
Albany Molecular Research, Inc.
US Patent
Assay Description
For binding analysis vs. the human receptor, samples were incubated in 50 mM Tris-HCl, pH 7.5, 5 mM MgCl2, 1 mM EDTA (4% DMSO final) with 10 nM [N-me...
US Patent US9067949 (2015)
BindingDB Entry DOI: 10.7270/Q23777FB