BDBM16644 2,2,2-trifluoro-N-(4-sulfamoylphenyl)acetamide::4-Trifluoroacetamido-benzenesulfonamide::CHEMBL417648::aromatic sulfonamide compound 9
SMILES: NS(=O)(=O)c1ccc(NC(=O)C(F)(F)F)cc1
InChI Key: InChIKey=KYCGMLPXHVMDAN-UHFFFAOYSA-N
Data: 8 KI
Activity Spreadsheet -- Enzyme Inhibition Constant Data from BindingDB
Found 8 hits for monomerid = 16644
Trg + Lig
Ki
nM
ΔG°
kcal/mole
IC50
nM
Kd
nM
EC50/IC50
nM
koff
s-1
kon
M-1s-1
pHTemp
°C
Carbonic anhydrase 12
(Homo sapiens (Human))
BDBM16644
(2,2,2-trifluoro-N-(4-sulfamoylphenyl)acetamide | 4...)
Show SMILES NS(=O)(=O)c1ccc(NC(=O)C(F)(F)F)cc1
Show InChI InChI=1S/C8H7F3N2O3S/c9-8(10,11)7(14)13-5-1-3-6(4-2-5)17(12,15)16/h1-4H,(H,13,14)(H2,12,15,16)
Reactome pathway
31n/an/an/an/an/an/an/an/a
Università degli Studi di Firenze
Curated by ChEMBL
Assay Description
Inhibitiory activity against human Carbonic anhydrase XII (hCA XII)
Bioorg Med Chem Lett 15: 4862-6 (2005)
Article DOI: 10.1016/j.bmcl.2005.08.048
BindingDB Entry DOI: 10.7270/Q2NK3DMJ
Carbonic anhydrase 5A, mitochondrial
(Mus musculus (mouse))
BDBM16644
(2,2,2-trifluoro-N-(4-sulfamoylphenyl)acetamide | 4...)
Show SMILES NS(=O)(=O)c1ccc(NC(=O)C(F)(F)F)cc1
Show InChI InChI=1S/C8H7F3N2O3S/c9-8(10,11)7(14)13-5-1-3-6(4-2-5)17(12,15)16/h1-4H,(H,13,14)(H2,12,15,16)
Reactome pathway
74n/an/an/an/an/an/an/an/a
Universita degli Studi di Firenze
Assay Description
An Applied Photophysics stopped-flow instrument has been used for assaying the CA-catalyzed CO2 hydration activity. Phenol red has been used as indic...
J Med Chem 47: 1272-9 (2004)
Article DOI: 10.1021/jm031057+
BindingDB Entry DOI: 10.7270/Q2MW2FDP
Carbonic anhydrase 9
(Homo sapiens (Human))
BDBM16644
(2,2,2-trifluoro-N-(4-sulfamoylphenyl)acetamide | 4...)
Show SMILES NS(=O)(=O)c1ccc(NC(=O)C(F)(F)F)cc1
Show InChI InChI=1S/C8H7F3N2O3S/c9-8(10,11)7(14)13-5-1-3-6(4-2-5)17(12,15)16/h1-4H,(H,13,14)(H2,12,15,16)
NCI pathway
Reactome pathway
112n/an/an/an/an/an/an/an/a
Università degli Studi di Firenze
Curated by ChEMBL
Assay Description
Inhibitiory activity against human Carbonic anhydrase IX (hCA IX)
Bioorg Med Chem Lett 15: 4862-6 (2005)
Article DOI: 10.1016/j.bmcl.2005.08.048
BindingDB Entry DOI: 10.7270/Q2NK3DMJ
Carbonic anhydrase 2
(Homo sapiens (Human))
BDBM16644
(2,2,2-trifluoro-N-(4-sulfamoylphenyl)acetamide | 4...)
Show SMILES NS(=O)(=O)c1ccc(NC(=O)C(F)(F)F)cc1
Show InChI InChI=1S/C8H7F3N2O3S/c9-8(10,11)7(14)13-5-1-3-6(4-2-5)17(12,15)16/h1-4H,(H,13,14)(H2,12,15,16)
Reactome pathway
133n/an/an/an/an/an/an/an/a
Università degli Studi di Firenze
Curated by ChEMBL
Assay Description
Inhibitiory activity against human Carbonic anhydrase II (hCA II)
Bioorg Med Chem Lett 15: 4862-6 (2005)
Article DOI: 10.1016/j.bmcl.2005.08.048
BindingDB Entry DOI: 10.7270/Q2NK3DMJ
Carbonic anhydrase 2
(Homo sapiens (Human))
BDBM16644
(2,2,2-trifluoro-N-(4-sulfamoylphenyl)acetamide | 4...)
Show SMILES NS(=O)(=O)c1ccc(NC(=O)C(F)(F)F)cc1
Show InChI InChI=1S/C8H7F3N2O3S/c9-8(10,11)7(14)13-5-1-3-6(4-2-5)17(12,15)16/h1-4H,(H,13,14)(H2,12,15,16)
Reactome pathway
133n/an/an/an/an/an/an/an/a
Universita degli Studi di Firenze
Assay Description
Initial rates of 4-nitrophenyl acetate hydrolysis catalyzed by different CA isozymes were monitored spectrophotometrically at 400 nm. A molar absorpt...
J Med Chem 47: 1272-9 (2004)
Article DOI: 10.1021/jm031057+
BindingDB Entry DOI: 10.7270/Q2MW2FDP
Carbonic anhydrase 4
(Bos taurus (bovine))
BDBM16644
(2,2,2-trifluoro-N-(4-sulfamoylphenyl)acetamide | 4...)
Show SMILES NS(=O)(=O)c1ccc(NC(=O)C(F)(F)F)cc1
Show InChI InChI=1S/C8H7F3N2O3S/c9-8(10,11)7(14)13-5-1-3-6(4-2-5)17(12,15)16/h1-4H,(H,13,14)(H2,12,15,16)
Reactome pathway
2.10E+3n/an/an/an/an/an/an/an/a
Universita degli Studi di Firenze
Assay Description
Initial rates of 4-nitrophenyl acetate hydrolysis catalyzed by different CA isozymes were monitored spectrophotometrically at 400 nm. A molar absorpt...
J Med Chem 47: 1272-9 (2004)
Article DOI: 10.1021/jm031057+
BindingDB Entry DOI: 10.7270/Q2MW2FDP
Carbonic anhydrase 1
(Homo sapiens (Human))
BDBM16644
(2,2,2-trifluoro-N-(4-sulfamoylphenyl)acetamide | 4...)
Show SMILES NS(=O)(=O)c1ccc(NC(=O)C(F)(F)F)cc1
Show InChI InChI=1S/C8H7F3N2O3S/c9-8(10,11)7(14)13-5-1-3-6(4-2-5)17(12,15)16/h1-4H,(H,13,14)(H2,12,15,16)
NCI pathway
Reactome pathway
1.46E+4n/an/an/an/an/an/an/an/a
Università degli Studi di Firenze
Curated by ChEMBL
Assay Description
Inhibitiory activity against human Carbonic anhydrase I (hCA I)
Bioorg Med Chem Lett 15: 4862-6 (2005)
Article DOI: 10.1016/j.bmcl.2005.08.048
BindingDB Entry DOI: 10.7270/Q2NK3DMJ
Carbonic anhydrase 1
(Homo sapiens (Human))
BDBM16644
(2,2,2-trifluoro-N-(4-sulfamoylphenyl)acetamide | 4...)
Show SMILES NS(=O)(=O)c1ccc(NC(=O)C(F)(F)F)cc1
Show InChI InChI=1S/C8H7F3N2O3S/c9-8(10,11)7(14)13-5-1-3-6(4-2-5)17(12,15)16/h1-4H,(H,13,14)(H2,12,15,16)
NCI pathway
Reactome pathway
1.46E+4 -6.59n/an/an/an/an/a7.425
Universita degli Studi di Firenze
Assay Description
Initial rates of 4-nitrophenyl acetate hydrolysis catalyzed by different CA isozymes were monitored spectrophotometrically at 400 nm. A molar absorpt...
J Med Chem 47: 1272-9 (2004)
Article DOI: 10.1021/jm031057+
BindingDB Entry DOI: 10.7270/Q2MW2FDP