BDBM16734 N-(2-{4-[(3S)-3-hydroxy-3-phenylpropyl]piperazin-1-yl}-5-phenylphenyl)naphthalene-1-carboxamide::N-(4-{4-[(3S)-3-hydroxy-3-phenylpropyl]piperazin-1-yl}biphenyl-3-yl)naphthalene-1-carboxamide::Naphthyl Compound, 5e
SMILES: O[C@@H](CCN1CCN(CC1)c1ccc(cc1NC(=O)c1cccc2ccccc12)-c1ccccc1)c1ccccc1
InChI Key: InChIKey=KLXPIHNTOUDGPI-DHUJRADRSA-N
Data: 2 IC50
Activity Spreadsheet -- Enzyme Inhibition Constant Data from BindingDB
Found 2 hits for monomerid = 16734
Trg + Lig
Ki
nM
ΔG°
kcal/mole
IC50
nM
Kd
nM
EC50/IC50
nM
koff
s-1
kon
M-1s-1
pHTemp
°C
Beta-secretase 1
(Homo sapiens (Human))
BDBM16734
(N-(2-{4-[(3S)-3-hydroxy-3-phenylpropyl]piperazin-1...)
Show SMILES O[C@@H](CCN1CCN(CC1)c1ccc(cc1NC(=O)c1cccc2ccccc12)-c1ccccc1)c1ccccc1 |r|
Show InChI InChI=1S/C36H35N3O2/c40-35(29-13-5-2-6-14-29)20-21-38-22-24-39(25-23-38)34-19-18-30(27-10-3-1-4-11-27)26-33(34)37-36(41)32-17-9-15-28-12-7-8-16-31(28)32/h1-19,26,35,40H,20-25H2,(H,37,41)/t35-/m0/s1
n/an/a 69n/an/an/an/an/an/a
Applied Science University
Curated by ChEMBL
Assay Description
Inhibition of BACE1 after 2 hrs by FRET assay
Bioorg Med Chem 18: 3088-115 (2010)
Article DOI: 10.1016/j.bmc.2010.03.043
BindingDB Entry DOI: 10.7270/Q2ZG6SFR
Beta-secretase 1
(Homo sapiens (Human))
BDBM16734
(N-(2-{4-[(3S)-3-hydroxy-3-phenylpropyl]piperazin-1...)
Show SMILES O[C@@H](CCN1CCN(CC1)c1ccc(cc1NC(=O)c1cccc2ccccc12)-c1ccccc1)c1ccccc1 |r|
Show InChI InChI=1S/C36H35N3O2/c40-35(29-13-5-2-6-14-29)20-21-38-22-24-39(25-23-38)34-19-18-30(27-10-3-1-4-11-27)26-33(34)37-36(41)32-17-9-15-28-12-7-8-16-31(28)32/h1-19,26,35,40H,20-25H2,(H,37,41)/t35-/m0/s1
n/an/a 69n/an/an/an/a7.525
Universite de la Mediterranee
Assay Description
These experiments have been preformed using BACE-1 FRET assay kit (PanVera Corporation, Madison, WI), using a multiwell spectrofluorometer instrument...
J Med Chem 49: 4275-85 (2006)
Article DOI: 10.1021/jm0602864
BindingDB Entry DOI: 10.7270/Q2QN651G