BDBM16749 Coumarin Compound, 11c::N-[2-(4-benzylpiperazin-1-yl)-5-phenylphenyl]-2-oxo-2H-chromene-3-carboxamide
SMILES: O=C(Nc1cc(ccc1N1CCN(Cc2ccccc2)CC1)-c1ccccc1)c1cc2ccccc2oc1=O
InChI Key: InChIKey=FVSBUQCOCOEDJM-UHFFFAOYSA-N
Data: 2 IC50
Activity Spreadsheet -- Enzyme Inhibition Constant Data from BindingDB
Found 2 hits for monomerid = 16749
Trg + Lig
Ki
nM
ΔG°
kcal/mole
IC50
nM
Kd
nM
EC50/IC50
nM
koff
s-1
kon
M-1s-1
pHTemp
°C
Beta-secretase 1
(Homo sapiens (Human))
BDBM16749
(Coumarin Compound, 11c | N-[2-(4-benzylpiperazin-1...)
Show SMILES O=C(Nc1cc(ccc1N1CCN(Cc2ccccc2)CC1)-c1ccccc1)c1cc2ccccc2oc1=O
Show InChI InChI=1S/C33H29N3O3/c37-32(28-21-27-13-7-8-14-31(27)39-33(28)38)34-29-22-26(25-11-5-2-6-12-25)15-16-30(29)36-19-17-35(18-20-36)23-24-9-3-1-4-10-24/h1-16,21-22H,17-20,23H2,(H,34,37)
n/an/a 151n/an/an/an/an/an/a
Applied Science University
Curated by ChEMBL
Assay Description
Inhibition of BACE1 after 2 hrs by FRET assay
Bioorg Med Chem 18: 3088-115 (2010)
Article DOI: 10.1016/j.bmc.2010.03.043
BindingDB Entry DOI: 10.7270/Q2ZG6SFR
Beta-secretase 1
(Homo sapiens (Human))
BDBM16749
(Coumarin Compound, 11c | N-[2-(4-benzylpiperazin-1...)
Show SMILES O=C(Nc1cc(ccc1N1CCN(Cc2ccccc2)CC1)-c1ccccc1)c1cc2ccccc2oc1=O
Show InChI InChI=1S/C33H29N3O3/c37-32(28-21-27-13-7-8-14-31(27)39-33(28)38)34-29-22-26(25-11-5-2-6-12-25)15-16-30(29)36-19-17-35(18-20-36)23-24-9-3-1-4-10-24/h1-16,21-22H,17-20,23H2,(H,34,37)
n/an/a 151n/an/an/an/an/an/a
Universite de la Mediterranee
Assay Description
These experiments have been preformed using BACE-1 FRET assay kit (PanVera Corporation, Madison, WI), using a multiwell spectrofluorometer instrument...
J Med Chem 49: 4275-85 (2006)
Article DOI: 10.1021/jm0602864
BindingDB Entry DOI: 10.7270/Q2QN651G