BDBM1678 (4R,5R,6R,7R)-1,3,4,7-tetrabenzyl-5,6-dihydroxy-1,3-diazepan-2-one::CHEMBL334312::Cyclic Urea diastereomer 8
SMILES: O[C@H]1[C@H](O)[C@@H](Cc2ccccc2)N(Cc2ccccc2)C(=O)N(Cc2ccccc2)[C@@H]1Cc1ccccc1
InChI Key: InChIKey=HZUCRWWOEVMAPC-SEVDZJIVSA-N
Data: 2 KI
PDB links: 14 PDB IDs contain this monomer as substructures. 8 PDB IDs contain inhibitors having a similarity of 90% to this monomer.
Activity Spreadsheet -- Enzyme Inhibition Constant Data from BindingDB
Found 2 hits for monomerid = 1678
Trg + Lig
Ki
nM
ΔG°
kcal/mole
IC50
nM
Kd
nM
EC50/IC50
nM
koff
s-1
kon
M-1s-1
pHTemp
°C
Human immunodeficiency virus type 1 protease
(Human immunodeficiency virus type 1)
BDBM1678
((4R,5R,6R,7R)-1,3,4,7-tetrabenzyl-5,6-dihydroxy-1,...)
Show SMILES O[C@H]1[C@H](O)[C@@H](Cc2ccccc2)N(Cc2ccccc2)C(=O)N(Cc2ccccc2)[C@@H]1Cc1ccccc1 |r|
Show InChI InChI=1S/C33H34N2O3/c36-31-29(21-25-13-5-1-6-14-25)34(23-27-17-9-3-10-18-27)33(38)35(24-28-19-11-4-12-20-28)30(32(31)37)22-26-15-7-2-8-16-26/h1-20,29-32,36-37H,21-24H2/t29-,30-,31-,32-/m1/s1
1.35E+3n/an/an/an/an/an/an/an/a
DuPont Pharmaceuticals Company
Curated by ChEMBL
Assay Description
Compound was tested for the inhibition of HIV-1 protease by assaying the cleavage of a fluorescent peptide using HPLC
Bioorg Med Chem Lett 8: 3615-20 (1999)
BindingDB Entry DOI: 10.7270/Q2VX0FP1
HIV-1 Protease
(Human immunodeficiency virus type 1)
BDBM1678
((4R,5R,6R,7R)-1,3,4,7-tetrabenzyl-5,6-dihydroxy-1,...)
Show SMILES O[C@H]1[C@H](O)[C@@H](Cc2ccccc2)N(Cc2ccccc2)C(=O)N(Cc2ccccc2)[C@@H]1Cc1ccccc1 |r|
Show InChI InChI=1S/C33H34N2O3/c36-31-29(21-25-13-5-1-6-14-25)34(23-27-17-9-3-10-18-27)33(38)35(24-28-19-11-4-12-20-28)30(32(31)37)22-26-15-7-2-8-16-26/h1-20,29-32,36-37H,21-24H2/t29-,30-,31-,32-/m1/s1
1.35E+3 -8.32n/an/an/an/an/a5.537
DuPont Merck Pharmaceutical Company
Assay Description
Inhibition of HIV protease was measured by assay of the cleavage of a fluorescent peptide substrate. The fluorescent product (2-aminobenzoyl-Ala-Thr-...
J Med Chem 41: 5113-7 (1998)
Article DOI: 10.1021/jm980255b
BindingDB Entry DOI: 10.7270/Q2Q23XDH