BDBM16789 3-[(2S)-2-amino-3-[(5-{1H-pyrazolo[3,4-c]pyridin-5-yl}pyridin-3-yl)oxy]propyl]-1H-indole::pyrazolopyridine analog, 9f
SMILES: N[C@H](COc1cncc(c1)-c1cc2cn[nH]c2cn1)Cc1c[nH]c2ccccc12
InChI Key: InChIKey=XKFSQFMROSGGGZ-KRWDZBQOSA-N
Data: 2 IC50
Activity Spreadsheet -- Enzyme Inhibition Constant Data from BindingDB
Found 2 hits for monomerid = 16789
Trg + Lig
Ki
nM
ΔG°
kcal/mole
IC50
nM
Kd
nM
EC50/IC50
nM
koff
s-1
kon
M-1s-1
pHTemp
°C
cAMP-Dependent Protein Kinase (PKA)
(Bos taurus (bovine))
BDBM16789
(3-[(2S)-2-amino-3-[(5-{1H-pyrazolo[3,4-c]pyridin-5...)
Show SMILES N[C@H](COc1cncc(c1)-c1cc2cn[nH]c2cn1)Cc1c[nH]c2ccccc12 |r|
Show InChI InChI=1S/C22H20N6O/c23-17(5-14-9-25-20-4-2-1-3-19(14)20)13-29-18-6-15(8-24-11-18)21-7-16-10-27-28-22(16)12-26-21/h1-4,6-12,17,25H,5,13,23H2,(H,27,28)/t17-/m0/s1
n/an/a 110n/an/an/an/an/an/a
Abbott Laboratories
Assay Description
The kinase assay uses purified recombinant enzyme and a biotinylated peptide as substrate. The biotinylated peptides were immobilized on streptavidi...
Bioorg Med Chem 15: 2441-52 (2007)
Article DOI: 10.1016/j.bmc.2007.01.010
BindingDB Entry DOI: 10.7270/Q26Q1VGQ
Protein kinase B (Akt 1)
(Homo sapiens (Human))
BDBM16789
(3-[(2S)-2-amino-3-[(5-{1H-pyrazolo[3,4-c]pyridin-5...)
Show SMILES N[C@H](COc1cncc(c1)-c1cc2cn[nH]c2cn1)Cc1c[nH]c2ccccc12 |r|
Show InChI InChI=1S/C22H20N6O/c23-17(5-14-9-25-20-4-2-1-3-19(14)20)13-29-18-6-15(8-24-11-18)21-7-16-10-27-28-22(16)12-26-21/h1-4,6-12,17,25H,5,13,23H2,(H,27,28)/t17-/m0/s1
n/an/a 0.600n/an/an/an/a7.522
Abbott Laboratories
Assay Description
The kinase assay uses His-Akt1 and a biotinylated peptide as substrate. The biotinylated peptides were immobilized on streptavidin-coated FLASH plat...
Bioorg Med Chem 15: 2441-52 (2007)
Article DOI: 10.1016/j.bmc.2007.01.010
BindingDB Entry DOI: 10.7270/Q26Q1VGQ