null
SMILES: OC(COc1ncnc2ccccc12)CN1CCN(CC1)c1ccc(F)cc1
InChI Key: InChIKey=BZBBEQZGZCRHQF-UHFFFAOYSA-N
Activity Spreadsheet -- Enzyme Inhibition Constant Data from BindingDB
Found 4 hits for monomerid = 167949
Trg + Lig
Ki
nM
ΔG°
kcal/mole
IC50
nM
Kd
nM
EC50/IC50
nM
koff
s-1
kon
M-1s-1
pHTemp
°C
Vascular endothelial growth factor receptor 2
(Homo sapiens (Human))
BDBM167949
(1-(4-(4-Fluorophenyl)piperazin-1-yl)-3-(quinazolin...)
Show SMILES OC(COc1ncnc2ccccc12)CN1CCN(CC1)c1ccc(F)cc1
Show InChI InChI=1S/C21H23FN4O2/c22-16-5-7-17(8-6-16)26-11-9-25(10-12-26)13-18(27)14-28-21-19-3-1-2-4-20(19)23-15-24-21/h1-8,15,18,27H,9-14H2
NCI pathway
Reactome pathway
n/an/a 21.8n/an/an/an/a7.225
Nanjing University
Assay Description
VEGFR kinase assays were set up to assess the level of autophosphorylation based on DELFIA/Time-Resolved Fluorometry. 96-well plates were coated at r...
Chem Biol Drug Des 86: 1323-9 (2015)
Article DOI: 10.1111/cbdd.12596
BindingDB Entry DOI: 10.7270/Q2GB22TR
Platelet-derived growth factor receptor beta
(Homo sapiens (Human))
BDBM167949
(1-(4-(4-Fluorophenyl)piperazin-1-yl)-3-(quinazolin...)
Show SMILES OC(COc1ncnc2ccccc12)CN1CCN(CC1)c1ccc(F)cc1
Show InChI InChI=1S/C21H23FN4O2/c22-16-5-7-17(8-6-16)26-11-9-25(10-12-26)13-18(27)14-28-21-19-3-1-2-4-20(19)23-15-24-21/h1-8,15,18,27H,9-14H2
NCI pathway
Reactome pathway
n/an/a 119n/an/an/an/a7.225
Nanjing University
Assay Description
VEGFR kinase assays were set up to assess the level of autophosphorylation based on DELFIA/Time-Resolved Fluorometry. 96-well plates were coated at r...
Chem Biol Drug Des 86: 1323-9 (2015)
Article DOI: 10.1111/cbdd.12596
BindingDB Entry DOI: 10.7270/Q2GB22TR
Fibroblast growth factor 2
(Homo sapiens (Human))
BDBM167949
(1-(4-(4-Fluorophenyl)piperazin-1-yl)-3-(quinazolin...)
Show SMILES OC(COc1ncnc2ccccc12)CN1CCN(CC1)c1ccc(F)cc1
Show InChI InChI=1S/C21H23FN4O2/c22-16-5-7-17(8-6-16)26-11-9-25(10-12-26)13-18(27)14-28-21-19-3-1-2-4-20(19)23-15-24-21/h1-8,15,18,27H,9-14H2
Reactome pathway
n/an/a 300n/an/an/an/a7.225
Nanjing University
Assay Description
VEGFR kinase assays were set up to assess the level of autophosphorylation based on DELFIA/Time-Resolved Fluorometry. 96-well plates were coated at r...
Chem Biol Drug Des 86: 1323-9 (2015)
Article DOI: 10.1111/cbdd.12596
BindingDB Entry DOI: 10.7270/Q2GB22TR
Epidermal growth factor receptor
(Homo sapiens (Human))
BDBM167949
(1-(4-(4-Fluorophenyl)piperazin-1-yl)-3-(quinazolin...)
Show SMILES OC(COc1ncnc2ccccc12)CN1CCN(CC1)c1ccc(F)cc1
Show InChI InChI=1S/C21H23FN4O2/c22-16-5-7-17(8-6-16)26-11-9-25(10-12-26)13-18(27)14-28-21-19-3-1-2-4-20(19)23-15-24-21/h1-8,15,18,27H,9-14H2
n/an/a 403n/an/an/an/a7.225
Nanjing University
Assay Description
VEGFR kinase assays were set up to assess the level of autophosphorylation based on DELFIA/Time-Resolved Fluorometry. 96-well plates were coated at r...
Chem Biol Drug Des 86: 1323-9 (2015)
Article DOI: 10.1111/cbdd.12596
BindingDB Entry DOI: 10.7270/Q2GB22TR