BDBM168001 US9073926, 35
SMILES: CC1CCNC(=O)c2cc3ccc(nc3n12)C(=O)Nc1cnc2n(CC3CCOC3)ncc2c1
InChI Key: InChIKey=GXLSDFNOALILGU-UHFFFAOYSA-N
Data: 1 IC50
Activity Spreadsheet -- Enzyme Inhibition Constant Data from BindingDB
Found 1 hit for monomerid = 168001
Trg + Lig
Ki
nM
ΔG°
kcal/mole
IC50
nM
Kd
nM
EC50/IC50
nM
koff
s-1
kon
M-1s-1
pHTemp
°C
Ribosomal protein S6 kinase alpha-3
(Homo sapiens (Human))
BDBM168001
(US9073926, 35)
Show SMILES CC1CCNC(=O)c2cc3ccc(nc3n12)C(=O)Nc1cnc2n(CC3CCOC3)ncc2c1
Show InChI InChI=1S/C24H25N7O3/c1-14-4-6-25-24(33)20-9-16-2-3-19(29-22(16)31(14)20)23(32)28-18-8-17-10-27-30(21(17)26-11-18)12-15-5-7-34-13-15/h2-3,8-11,14-15H,4-7,12-13H2,1H3,(H,25,33)(H,28,32)
Reactome pathway
US Patent
n/an/a 1.60n/an/an/an/a7.5n/a
Boehringer Ingelheim International GmbH
US Patent
Assay Description
Human RSK2 protein, purchased from Invitrogen, is used to measure kinase activity utilizing Kinase Glo Plus (Promega) a homogeneous assay technology,...
US Patent US9073926 (2015)
BindingDB Entry DOI: 10.7270/Q2BP01J6