BDBM16809 (2S)-2-[(2,6-dichlorophenyl)formamido]-3-{4-[2-(2-hydroxyethyl)-5-methoxy-3-oxo-2,3-dihydropyridazin-4-yl]phenyl}propanoic acid::pyridazinone-based antagonist, 11
SMILES: COc1cnn(CCO)c(=O)c1-c1ccc(C[C@H](NC(=O)c2c(Cl)cccc2Cl)C(O)=O)cc1
InChI Key: InChIKey=BVCWBPBHALGRTA-KRWDZBQOSA-N
Data: 2 IC50
Activity Spreadsheet -- Enzyme Inhibition Constant Data from BindingDB
Found 2 hits for monomerid = 16809
Trg + Lig
Ki
nM
ΔG°
kcal/mole
IC50
nM
Kd
nM
EC50/IC50
nM
koff
s-1
kon
M-1s-1
pHTemp
°C
Integrin alpha4beta7
(Homo sapiens (Human))
BDBM16809
((2S)-2-[(2,6-dichlorophenyl)formamido]-3-{4-[2-(2-...)
Show SMILES COc1cnn(CCO)c(=O)c1-c1ccc(C[C@H](NC(=O)c2c(Cl)cccc2Cl)C(O)=O)cc1 |r|
Show InChI InChI=1S/C23H21Cl2N3O6/c1-34-18-12-26-28(9-10-29)22(31)19(18)14-7-5-13(6-8-14)11-17(23(32)33)27-21(30)20-15(24)3-2-4-16(20)25/h2-8,12,17,29H,9-11H2,1H3,(H,27,30)(H,32,33)/t17-/m0/s1
n/an/a 2n/an/an/an/an/a4
Johnson & Johnson Pharmaceutical
Assay Description
M2 anti-FLAG antibody coated 96-well plates were coated with recombinant FLAG-hMAdCAM-1 contained in Dulbecco PBS. The compounds to be tested were ad...
J Med Chem 49: 3402-11 (2006)
Article DOI: 10.1021/jm060031q
BindingDB Entry DOI: 10.7270/Q2Z60M9V
Integrin alpha4beta1 (VLA-4)
(Homo sapiens (Human))
BDBM16809
((2S)-2-[(2,6-dichlorophenyl)formamido]-3-{4-[2-(2-...)
Show SMILES COc1cnn(CCO)c(=O)c1-c1ccc(C[C@H](NC(=O)c2c(Cl)cccc2Cl)C(O)=O)cc1 |r|
Show InChI InChI=1S/C23H21Cl2N3O6/c1-34-18-12-26-28(9-10-29)22(31)19(18)14-7-5-13(6-8-14)11-17(23(32)33)27-21(30)20-15(24)3-2-4-16(20)25/h2-8,12,17,29H,9-11H2,1H3,(H,27,30)(H,32,33)/t17-/m0/s1
n/an/a 130n/an/an/an/a7.422
Johnson & Johnson Pharmaceutical
Assay Description
Immulon 96-well plates were coated with recombinant hVCAM-1 overnight at 4 C. Plates were washed and blocked for 1 h at room temperature in PBS-BSA....
J Med Chem 49: 3402-11 (2006)
Article DOI: 10.1021/jm060031q
BindingDB Entry DOI: 10.7270/Q2Z60M9V