null
SMILES: CC(C)C(=O)N(COCC[Si](C)(C)C)c1ncnc2n(COCC[Si](C)(C)C)nnc12
InChI Key: InChIKey=DMFRKWDLXLCZCZ-UHFFFAOYSA-N
Activity Spreadsheet -- Enzyme Inhibition Constant Data from BindingDB
Found 2 hits for monomerid = 168311
Trg + Lig
Ki
nM
ΔG°
kcal/mole
IC50
nM
Kd
nM
EC50/IC50
nM
koff
s-1
kon
M-1s-1
pHTemp
°C
MAP kinase-interacting serine/threonine-protein kinase 2
(Homo sapiens (Human))
BDBM168311
(US9669031, 146 8-chloro-6-(3H-triazolo[4,5-d]pyrim...)
Show SMILES CC(C)C(=O)N(COCC[Si](C)(C)C)c1ncnc2n(COCC[Si](C)(C)C)nnc12
Show InChI InChI=1S/C20H38N6O3Si2/c1-16(2)20(27)25(14-28-9-11-30(3,4)5)18-17-19(22-13-21-18)26(24-23-17)15-29-10-12-31(6,7)8/h13,16H,9-12,14-15H2,1-8H3
US Patent
n/an/a<10n/an/an/an/an/a25
eFFECTOR THERAPEUTICS, INC.
US Patent
Assay Description
Compounds are screened for Mnk inhibition using the ADP-Glo kinase assay kit (Promega, catalogue No. V9101). All kinase reactions are performed in Re...
US Patent US9669031 (2017)
BindingDB Entry DOI: 10.7270/Q26Q1VDT
MAP kinase-interacting serine/threonine-protein kinase 1
(Homo sapiens (Human))
BDBM168311
(US9669031, 146 8-chloro-6-(3H-triazolo[4,5-d]pyrim...)
Show SMILES CC(C)C(=O)N(COCC[Si](C)(C)C)c1ncnc2n(COCC[Si](C)(C)C)nnc12
Show InChI InChI=1S/C20H38N6O3Si2/c1-16(2)20(27)25(14-28-9-11-30(3,4)5)18-17-19(22-13-21-18)26(24-23-17)15-29-10-12-31(6,7)8/h13,16H,9-12,14-15H2,1-8H3
NCI pathway
Reactome pathway
US Patent
n/an/a<10n/an/an/an/an/a25
eFFECTOR THERAPEUTICS, INC.
US Patent
Assay Description
Compounds are screened for Mnk inhibition using the ADP-Glo kinase assay kit (Promega, catalogue No. V9101). All kinase reactions are performed in Re...
US Patent US9669031 (2017)
BindingDB Entry DOI: 10.7270/Q26Q1VDT