BDBM168331 US9669031, 164 8′-chloro-1′,5′-dioxo-6′-(pyrimidin-4-ylamino)-1′,5′-dihydro-2′H-spiro[cyclohexane-1,3′-imidazo[1,5-a]pyridine]-4-carbonitrile (Cpd. No. 164)
SMILES: Clc1cc(Nc2ccncn2)c(=O)n2c1C(=O)NC21CCN(CC1)C#N
InChI Key: InChIKey=GKABENCNXKROOG-UHFFFAOYSA-N
Data: 1 IC50
Activity Spreadsheet -- Enzyme Inhibition Constant Data from BindingDB
Found 1 hit for monomerid = 168331
Trg + Lig
Ki
nM
ΔG°
kcal/mole
IC50
nM
Kd
nM
EC50/IC50
nM
koff
s-1
kon
M-1s-1
pHTemp
°C
MAP kinase-interacting serine/threonine-protein kinase 2
(Homo sapiens (Human))
BDBM168331
(US9669031, 164 8′-chloro-1′,5′-d...)
Show SMILES Clc1cc(Nc2ccncn2)c(=O)n2c1C(=O)NC21CCN(CC1)C#N
Show InChI InChI=1S/C16H14ClN7O2/c17-10-7-11(21-12-1-4-19-9-20-12)15(26)24-13(10)14(25)22-16(24)2-5-23(8-18)6-3-16/h1,4,7,9H,2-3,5-6H2,(H,22,25)(H,19,20,21)
US Patent
n/an/a<10n/an/an/an/an/a25
eFFECTOR THERAPEUTICS, INC.
US Patent
Assay Description
Compounds are screened for Mnk inhibition using the ADP-Glo kinase assay kit (Promega, catalogue No. V9101). All kinase reactions are performed in Re...
US Patent US9669031 (2017)
BindingDB Entry DOI: 10.7270/Q26Q1VDT