null
SMILES: CC(C)c1c(Nc2cc(Cl)c3C(=O)NC4(CCCCC4)n3c2=O)ncnc1N(C(=O)OC(C)(C)C)C(=O)OC(C)(C)C
InChI Key: InChIKey=PQDAELROGFSJPN-UHFFFAOYSA-N
Activity Spreadsheet -- Enzyme Inhibition Constant Data from BindingDB
Found 1 hit for monomerid = 168340
Trg + Lig
Ki
nM
ΔG°
kcal/mole
IC50
nM
Kd
nM
EC50/IC50
nM
koff
s-1
kon
M-1s-1
pHTemp
°C
MAP kinase-interacting serine/threonine-protein kinase 2
(Homo sapiens (Human))
BDBM168340
(US9669031, 189 6′-((6-amino-5-isopropylpyrim...)
Show SMILES CC(C)c1c(Nc2cc(Cl)c3C(=O)NC4(CCCCC4)n3c2=O)ncnc1N(C(=O)OC(C)(C)C)C(=O)OC(C)(C)C
Show InChI InChI=1S/C29H39ClN6O6/c1-16(2)19-21(31-15-32-22(19)35(25(39)41-27(3,4)5)26(40)42-28(6,7)8)33-18-14-17(30)20-23(37)34-29(36(20)24(18)38)12-10-9-11-13-29/h14-16H,9-13H2,1-8H3,(H,34,37)(H,31,32,33)
US Patent
n/an/a<10n/an/an/an/an/a25
eFFECTOR THERAPEUTICS, INC.
US Patent
Assay Description
Compounds are screened for Mnk inhibition using the ADP-Glo kinase assay kit (Promega, catalogue No. V9101). All kinase reactions are performed in Re...
US Patent US9669031 (2017)
BindingDB Entry DOI: 10.7270/Q26Q1VDT