null
SMILES: CC(C)Oc1cncnc1Nc1cc(Cl)c2C(=O)NC3(CCCCC3)n2c1=O
InChI Key: InChIKey=DPXADVRYWJJDPN-UHFFFAOYSA-N
Activity Spreadsheet -- Enzyme Inhibition Constant Data from BindingDB
Found 1 hit for monomerid = 168348
Trg + Lig
Ki
nM
ΔG°
kcal/mole
IC50
nM
Kd
nM
EC50/IC50
nM
koff
s-1
kon
M-1s-1
pHTemp
°C
MAP kinase-interacting serine/threonine-protein kinase 2
(Homo sapiens (Human))
BDBM168348
(US9669031, 197 8′-chloro-6′-((5-isopro...)
Show SMILES CC(C)Oc1cncnc1Nc1cc(Cl)c2C(=O)NC3(CCCCC3)n2c1=O
Show InChI InChI=1S/C19H22ClN5O3/c1-11(2)28-14-9-21-10-22-16(14)23-13-8-12(20)15-17(26)24-19(25(15)18(13)27)6-4-3-5-7-19/h8-11H,3-7H2,1-2H3,(H,24,26)(H,21,22,23)
US Patent
n/an/a<10n/an/an/an/an/a25
eFFECTOR THERAPEUTICS, INC.
US Patent
Assay Description
Compounds are screened for Mnk inhibition using the ADP-Glo kinase assay kit (Promega, catalogue No. V9101). All kinase reactions are performed in Re...
US Patent US9669031 (2017)
BindingDB Entry DOI: 10.7270/Q26Q1VDT