null
SMILES: Cc1cc(Nc2ncnc(NC(=O)C3CC3)c2C)c(=O)n2c1C(=O)NC21CCN(CC(F)(F)F)CC1
InChI Key: InChIKey=PTSMKHQISMDSQH-UHFFFAOYSA-N
Activity Spreadsheet -- Enzyme Inhibition Constant Data from BindingDB
Found 1 hit for monomerid = 168381
Trg + Lig
Ki
nM
ΔG°
kcal/mole
IC50
nM
Kd
nM
EC50/IC50
nM
koff
s-1
kon
M-1s-1
pHTemp
°C
MAP kinase-interacting serine/threonine-protein kinase 2
(Homo sapiens (Human))
BDBM168381
(US9669031, 236 6-((6-amino-5-methylpyrimidin-4-yl)...)
Show SMILES Cc1cc(Nc2ncnc(NC(=O)C3CC3)c2C)c(=O)n2c1C(=O)NC21CCN(CC(F)(F)F)CC1
Show InChI InChI=1S/C23H26F3N7O3/c1-12-9-15(29-17-13(2)18(28-11-27-17)30-19(34)14-3-4-14)21(36)33-16(12)20(35)31-22(33)5-7-32(8-6-22)10-23(24,25)26/h9,11,14H,3-8,10H2,1-2H3,(H,31,35)(H2,27,28,29,30,34)
US Patent
n/an/a<10n/an/an/an/an/a25
eFFECTOR THERAPEUTICS, INC.
US Patent
Assay Description
Compounds are screened for Mnk inhibition using the ADP-Glo kinase assay kit (Promega, catalogue No. V9101). All kinase reactions are performed in Re...
US Patent US9669031 (2017)
BindingDB Entry DOI: 10.7270/Q26Q1VDT