BDBM16841 (2S)-3-{4-[(3,5-dichloropyridine-4-)amido]phenyl}-2-{[(3S)-2-(3-methoxypropanoyl)-2-azabicyclo[2.2.2]octan-3-yl]formamido}propanoic acid::azabicyclo[2.2.2]octane derivative, 26
SMILES: COCCC(=O)N1C2CCC(CC2)[C@H]1C(=O)N[C@@H](Cc1ccc(NC(=O)c2c(Cl)cncc2Cl)cc1)C(O)=O
InChI Key: InChIKey=OPJPYKMELCADQL-ZWEZHYNLSA-N
Data: 2 IC50
Activity Spreadsheet -- Enzyme Inhibition Constant Data from BindingDB
Found 2 hits for monomerid = 16841
Trg + Lig
Ki
nM
ΔG°
kcal/mole
IC50
nM
Kd
nM
EC50/IC50
nM
koff
s-1
kon
M-1s-1
pHTemp
°C
Integrin alpha4beta7
(Homo sapiens (Human))
BDBM16841
((2S)-3-{4-[(3,5-dichloropyridine-4-)amido]phenyl}-...)
Show SMILES COCCC(=O)N1C2CCC(CC2)[C@H]1C(=O)N[C@@H](Cc1ccc(NC(=O)c2c(Cl)cncc2Cl)cc1)C(O)=O |r,wU:13.15,17.18,TLB:14:13:9.8:11.12,THB:4:6:9.8:11.12,(7.25,-11.19,;8.58,-11.96,;9.91,-11.19,;11.25,-11.96,;12.58,-11.19,;13.91,-11.96,;12.58,-9.65,;11.25,-8.88,;11.25,-7.34,;10.76,-6.46,;10.76,-8,;9.43,-8.77,;9.91,-9.65,;12.1,-8.77,;13.43,-8,;13.43,-6.46,;14.76,-8.77,;16.1,-8,;16.1,-6.46,;17.43,-5.69,;17.43,-4.15,;18.76,-3.38,;20.1,-4.15,;21.43,-3.38,;22.77,-4.15,;22.77,-5.69,;24.1,-3.38,;24.13,-1.84,;22.82,-1.04,;25.48,-1.1,;26.8,-1.9,;26.77,-3.44,;25.42,-4.18,;25.38,-5.72,;20.1,-5.69,;18.76,-6.46,;17.43,-8.77,;18.76,-8,;17.43,-10.31,)|
Show InChI InChI=1S/C27H30Cl2N4O6/c1-39-11-10-22(34)33-18-8-4-16(5-9-18)24(33)26(36)32-21(27(37)38)12-15-2-6-17(7-3-15)31-25(35)23-19(28)13-30-14-20(23)29/h2-3,6-7,13-14,16,18,21,24H,4-5,8-12H2,1H3,(H,31,35)(H,32,36)(H,37,38)/t16?,18?,21-,24-/m0/s1
n/an/a 110n/an/an/an/an/a4
Johnson & Johnson Pharmaceutical
Assay Description
M2 anti-FLAG antibody coated 96-well plates were coated with recombinant FLAG-hMAdCAM-1 contained in Dulbecco PBS. The compounds to be tested were ad...
Bioorg Med Chem 13: 6693-702 (2005)
Article DOI: 10.1016/j.bmc.2005.07.022
BindingDB Entry DOI: 10.7270/Q2TD9VM1
Integrin alpha4beta1 (VLA-4)
(Homo sapiens (Human))
BDBM16841
((2S)-3-{4-[(3,5-dichloropyridine-4-)amido]phenyl}-...)
Show SMILES COCCC(=O)N1C2CCC(CC2)[C@H]1C(=O)N[C@@H](Cc1ccc(NC(=O)c2c(Cl)cncc2Cl)cc1)C(O)=O |r,wU:13.15,17.18,TLB:14:13:9.8:11.12,THB:4:6:9.8:11.12,(7.25,-11.19,;8.58,-11.96,;9.91,-11.19,;11.25,-11.96,;12.58,-11.19,;13.91,-11.96,;12.58,-9.65,;11.25,-8.88,;11.25,-7.34,;10.76,-6.46,;10.76,-8,;9.43,-8.77,;9.91,-9.65,;12.1,-8.77,;13.43,-8,;13.43,-6.46,;14.76,-8.77,;16.1,-8,;16.1,-6.46,;17.43,-5.69,;17.43,-4.15,;18.76,-3.38,;20.1,-4.15,;21.43,-3.38,;22.77,-4.15,;22.77,-5.69,;24.1,-3.38,;24.13,-1.84,;22.82,-1.04,;25.48,-1.1,;26.8,-1.9,;26.77,-3.44,;25.42,-4.18,;25.38,-5.72,;20.1,-5.69,;18.76,-6.46,;17.43,-8.77,;18.76,-8,;17.43,-10.31,)|
Show InChI InChI=1S/C27H30Cl2N4O6/c1-39-11-10-22(34)33-18-8-4-16(5-9-18)24(33)26(36)32-21(27(37)38)12-15-2-6-17(7-3-15)31-25(35)23-19(28)13-30-14-20(23)29/h2-3,6-7,13-14,16,18,21,24H,4-5,8-12H2,1H3,(H,31,35)(H,32,36)(H,37,38)/t16?,18?,21-,24-/m0/s1
n/an/a 8n/an/an/an/a7.422
Johnson & Johnson Pharmaceutical
Assay Description
Immulon 96-well plates were coated with recombinant hVCAM-1 overnight at 4 C. Plates were washed and blocked for 1 h at room temperature in PBS-BSA....
Bioorg Med Chem 13: 6693-702 (2005)
Article DOI: 10.1016/j.bmc.2005.07.022
BindingDB Entry DOI: 10.7270/Q2TD9VM1