BDBM168439 US9675593, 12
SMILES: CC(=O)c1ccc(=O)n(c1)-c1ccc(Cl)cc1
InChI Key: InChIKey=XMQTXTPATZTEHL-UHFFFAOYSA-N
Data: 1 EC50
Activity Spreadsheet -- Enzyme Inhibition Constant Data from BindingDB
Found 1 hit for monomerid = 168439
Trg + Lig
Ki
nM
ΔG°
kcal/mole
IC50
nM
Kd
nM
EC50/IC50
nM
koff
s-1
kon
M-1s-1
pHTemp
°C
Endothelin-1
(Homo sapiens (Human))
BDBM168439
(US9675593, 12)
Show SMILES CC(=O)c1ccc(=O)n(c1)-c1ccc(Cl)cc1
Show InChI InChI=1S/C13H10ClNO2/c1-9(16)10-2-7-13(17)15(8-10)12-5-3-11(14)4-6-12/h2-8H,1H3
US Patent
n/an/an/an/a>2.00E+5n/an/an/an/a
SRMLSC
US Patent
Assay Description
Fibroblasts (primary human lung and dermal, HFL-1, 3T3 etc) are seeded in 96-well plates at ~15000 cells/well and serum starved for 0-48 hours. After...
US Patent US9675593 (2017)
BindingDB Entry DOI: 10.7270/Q2319T24